{"text_format":"3","workbook":"xlsx","n_sheets":17,"sheets":["Menu","ResidentialGuide","SMSFGuide","CommercialGuide","LeaseDocGuide","Residential","Commercial","SMSF","Residential SMSF","LeaseDoc","Tax Tables","Tax Tables (C)","SMSF Tax Tables","Resi SMSF Tax Tables","HEM","List","Linked Picture"],"not_rendered":{"images":19,"macros":1,"defined_names":9},"read":"whole","date_system":"1900"}

{"sheet":"Menu","index":0,"n_rows":21,"n_cols":1,"rows_kept":21,"merged":[[0,6,3,11],[4,0,4,11],[5,0,5,11],[20,0,22,11]]}
[]
[]
[]
[]
["Serviceability Calculator"]
["Version 1.18 (1 September 2023)"]
{"$rows_empty":14}
[{"$f":"'Linked Picture'!J3","v":"The information contained in this calculator is provided by LoanOne Pty Ltd ACN  161 283 147, Australian Credit License 501182 for illustrative purposes only and should not be regarded as a prediction, or as personal advice. Calculations are not forecasts or projections but is a tool that may assist you to make your own projections. The calculator is not intended to be a substitute for professional advice. The information in this calculator does not constitute an offer to lend, or imply the product is suitable for clients. Before acting on this general information, your client must consider its appropriateness having regard to their own objectives, financial situation and need and also seek independent financial, legal and taxation advice. No guarantee, warranty, or representation is given or implied as to the reliability or accuracy of the information use to compile each index or each calculation. LoanOne specifically disclaims any liability for any direct, indirect, incidental, consequential, or special damages or for any loss arising out of or in any way connected with the access to, reliance on, or use of this calculator."}]

{"sheet":"ResidentialGuide","index":1,"n_rows":72,"n_cols":2,"rows_kept":72,"hidden":true,"merged":[[0,0,3,11],[11,0,11,11],[16,1,17,11],[18,0,18,11],[23,1,24,11],[28,1,29,11],[34,1,35,11],[51,0,52,0],[51,1,52,11]]}
[]
[]
[]
[]
[]
["User Guide"]
[]
["Residential Serviceability Calculator"]
["Application Name:","Enter the applicants name"]
["Application #:","Enter the application number (if known)"]
[]
["Income Details"]
["Applicant Details:"]
["Heading:","Able to amend the headings for 'Applicant 1', 'Applicant 2', etc to the actual applicant name. "]
["Status:","Select the relevant household relationship status option from the dropdown box. "]
[null,"Is the applicant Individual (Single), Individual (Couple), or a Company  "]
["Household:","Enter the household number that the appliant is a member of. If there is more than one applicant and they reside in separate households (and will continue to do so after settlement), enter 1, 2 and/or 3 respectively. "]
[]
[]
["Individual:","For individual applicants"]
["HECS / HELP Debt:","If relevant, select Yes from the dropdown box, otherwise leave as No"]
["Gross Annual Income ","If a PAYG individual, enter their gross annual income figure (pre-tax, excluding employer superannuation)."]
[null,"If a Self-Employed individual, enter their net profit before tax figure including allowable add-backs e.g. depreciation"]
["Annual Non-Taxable Income:","Enter the individuals annual non-taxable income (for example, government benefit, Family A&B payment. Some industries provide a portion of salary as non-taxable)"]
[]
["Annual Gross Rental Income:","Enter the individuals share of gross rental income from investment properties (existing and proposed). "]
[null,"(The calculator will adopt 80% of the gross rental figure)."]
["Annual Investment Property Interest:","Negative gearing. Enter the annual interest amount for existing and proposed investment property loans."]
["Annual Investment Property utilities, rates & costs:","Enter the current and proposed investment property costs (12x declared Investment Property Costs in declared living expenses)"]
[]
["Company:","For Company applicants"]
["NPBT:","Enter the annual company Net Profit Before Tax (after all company expenses have been accounted for)"]
["Addbacks:","Acceptable Addbacks:"]
[null,"   + Depreciation amount from the recent company Financial Statements."]
[null,"   + Annual interest on an existing company loan being refinanced with this ORDE loan, or has or will be    \n      repaid prior to settlement."]
[]
[null,"   + One off expenses which can be verified as non-recurring. "]
["Annual Gross Rental Income (not included in NPBT):","New / proposed rental income to be received by the company."]
["Living Expenses (Per Month):       (*non-HEM expenses)","If there is more than one household, enter the living expenses for each relevant household.  "]
["Dependents","Enter the number of dependents for each relevant household."]
["Primary Residence property utilities, rates & costs","Council rates, water rates, utilities, land tax, property maintenance, furnishings."]
["Groceries","Groceries (food and non-alcoholic beverages), toiletries, cleaning products."]
["Clothing & Personal Care","Clothing, footwear, personal care products, cosmetics, hairdressers."]
["Transport","Fuel, registration, vehicle maintenance, parking, tolls, public transport, ride share."]
["Medical & Health","General Practitioners, Medical Specialists, Optical, Dental, Pharmacy "]
["Education (excluding Private School Fees)","Public school fees, books, uniforms, camps, etc. Training fees, higher education, vocational training."]
["Education - Private School Fees *","Private school fees and costs."]
["Childcare","Day Care, Kindergarten, Baby Sitting, etc (Childcare payments after rebate)."]
["Insurance (excluding Private Health, Life and IP)","Home, contents, vehicle insurance, pet, general property insurance"]
["Private Health, Life and IP Insurance *","Private Health, Life, Total Permanent Disability (TPD), Income Protection (IP) (not included in super fund) "]
["Telephone, Internet, Pay TV & Media Streaming","Telephone, internet, pay TV, media streaming (netflix, spotify, etc)"]
["Recreation & Entertainment","Eating out, takeaway food and drinks, alcohol, tobacco products, concerts, movies, gambling, purchase and hire of recreational / sports items, holidays."]
[]
["Memberships ","Gym, sporting clubs, subscriptions."]
["Non-Complusory Superannuation *","Additonal superannuation contributions."]
["Maintenance *","Child support for non-dependent children, maintenance payments to ex-partners."]
["Other Living Expenses","All other expenses not accounted for in above categories."]
["Other Commitments"]
["For owner occupied and investment loans, enter the current outstanding balance and the actual monthly repayment amount e.g. interest only or principal and interest. "]
["For loans which are in advance / have redraw available, enter the total debt that the loan can be drawn up to (balance + redraw)."]
["For Lines of Credit  / Overdrafts, enter the approved facility limit and the contracted monthly repayment amount."]
["For Personal Loans, enter the current outstanding balance and the monthly repayment amount. "]
["For Credit Cards, enter the approved card limit. (The calculator will adopt 3.8% of the total limit as a repayment amount, regardless of the outstanding balance). "]
["Rent / Board: If the applicant is currently residing in a rental property and will continue to do so after settlement, enter the current monthly rental expense. "]
["Loan Details"]
["New Loan Amount","Enter the proposed new ORDE Financial loan amount"]
["Interest Rate:","Enter the relevant product interest rate (as per Product Guide) "]
["Repayment Type:","Select relevant repayment type - Amortising or Bullet"]
[null," - Amortising: Principal (post Interest Only period) repaid over the life of the loan"]
[null," - Bullet: Interest Only for the life of the loan, Principal to be repaid at loan maturity"]
["Loan Term (Years):","Enter the requested Loan Term"]
["Interest Only Term (Years): ","If seeking an initial interest only period, enter the number of years "]

{"sheet":"SMSFGuide","index":2,"n_rows":39,"n_cols":2,"rows_kept":39,"hidden":true,"merged":[[0,0,3,11],[17,1,17,11],[18,1,18,11],[19,0,19,11],[25,1,25,11],[29,1,29,11],[30,1,30,11]]}
[]
[]
[]
[]
[]
["User Guide"]
[]
["SMSF Serviceability Calculator"]
["Application Name:","Enter the applicants name"]
["Application #:","Enter the application number (if known)"]
[]
["Income Details"]
["Applicant Details:"]
["Heading:","Able to amend the headings for 'Member 1', 'Member 2', etc to the actual SMSF Members name. "]
["Gross Annual Income:","Enter the gross annual income amount for each SMSF member"]
["Compulsory Superannuation Contributions:","Enter the compulsory superannuation contribution amount the SMSF member receives"]
["Superannuation Contributions (%)","Will auto calculate from the figures entered above."]
["Salary Sacrifice Contributions","Enter the amount of contributions the SMSF members makes via salary sacrifice "]
["Non-Concessional Contributions","Enter the amount of after tax superannuation contributions"]
[]
["SMSF Details:"]
["Annual Gross Rental Income (Security)","Enter the annual gross rental income derived from the property offered as secruity. "]
["Annual Gross Rental Income (Other)","Enter the annual gross rental income derived from existing SMSF investment properties. "]
["Other SMSF Assets","Enter the indicative post-settlement SMSF Cash Management Account residual balance. (Adopts a 3% return)"]
["SMSF Ongoing Expenses (Annual)"]
["Total Ongoing SMSF Expenses Declared","Enter the amount of ongoing SMSF expenses (accounting, administrative, property, insurances, etc)"]
[null,"*A minimum of $2,500 will apply. Where the SMSF has existing assets, the SMSF financials are to be "]
[null,"reviewed to confirm the ongoing expenses. "]
["Other Commitments"]
["Investment Property 1","If the SMSF has an existing loan, enter the loan mount, repayment amount and interest rate"]
["Investment Property 2","If the SMSF has an existing loan, enter the loan mount, repayment amount and interest rate"]
["Loan Details"]
["New Loan Amount","Enter the proposed new ORDE Financial loan amount"]
["Interest Rate:","Enter the relevant product interest rate (as per Product Guide) "]
["Repayment Type:","Select relevant repayment type - Amortising or Bullet"]
[null,"- Amortising: Principal (post Interest Only period) repaid over the life of the loan"]
[null," - Bullet: Interest Only for the life of the loan, Principal to be repaid at loan maturity"]
["Loan Term (Years):","Enter the requested Loan Term"]
["Interest Only Term (Years): ","If seeking an initial interest only period, enter the number of years "]

{"sheet":"CommercialGuide","index":3,"n_rows":71,"n_cols":2,"rows_kept":71,"hidden":true,"merged":[[0,0,3,11],[11,0,11,11],[16,1,17,11],[18,0,18,11],[23,1,24,11],[28,1,29,11],[32,1,33,11],[50,0,51,0],[50,1,51,11]]}
[]
[]
[]
[]
[]
["User Guide"]
[]
["Commercial Serviceability Calculator"]
["Application Name:","Enter the applicants name"]
["Application #:","Enter the application number (if known)"]
[]
["Income Details"]
["Applicant Details:"]
["Heading:","Able to amend the headings for 'Applicant 1', 'Applicant 2', etc to the actual applicant name. "]
["Status:","Select the relevant household relationship status option from the dropdown box. "]
[null,"Is the applicant Individual (Single), Individual (Couple), or a Company  "]
["Household:","Enter the household number that the appliant is a member of. If there is more than one applicant and they reside in separate households (and will continue to do so after settlement), enter 1, 2 and/or 3 respectively. "]
[]
[]
["Individual:","For individual applicants"]
["HECS / HELP Debt:","If relevant, select Yes from the dropdown box, otherwise leave as No"]
["Gross Annual Income ","If a PAYG individual, enter their gross annual income figure (pre-tax, excluding employer superannuation)."]
[null,"If a Self-Employed individual, enter their net profit before tax figure including allowable add-backs e.g. depreciation."]
["Annual Non-Taxable Income:","Enter the individuals annual non-taxable income (for example, government benefit, Family A&B payment. Some industries provide a portion of salary as non-taxable)"]
[]
["Annual Gross Rental Income:","Enter the individuals share of gross rental income from investment properties (existing and proposed). "]
[null,"(The calculator will adopt 80% of the gross rental figure)."]
["Investment Property Interest Expense:","Negative gearing. Enter the annual interest amount for existing and proposed investment property loans."]
["Investment Property utilities, rates & costs:","Enter the current and proposed investment property costs (12x declared Investment Property Costs in declared living expenses)"]
[]
["Company:","For Company applicants"]
["Company NPBT:","Enter the annual company Net Profit Before Tax (after all company expenses have been accounted for)"]
["Addbacks - Interest Paid:","Annual interest on an existing company loan being refinanced with this ORDE loan, or has or will be repaid prior to settlement."]
[]
["Addbacks - Other","Depreciation amount from the recent company Financial Statements."]
[null,"One off expenses which can be verified as non-recurring. "]
["Annual Gross Rental Income (not included in NPBT):","New / proposed rental income to be received by the company."]
["Living Expenses (Per Month):       (*non-HEM Expenses)","If there is more than one household, enter the living expenses for each relevant household.  "]
["Dependents","Enter the number of dependents for each relevant household."]
["Primary Residence property utilities, rates & costs","Council rates, water rates, utilities, land tax, property maintenance, furnishings."]
["Groceries","Groceries (food and non-alcoholic beverages), toiletries, cleaning products."]
["Clothing & Personal Care","Clothing, footwear, personal care products, cosmetics, hairdressers."]
["Transport","Fuel, registration, vehicle maintenance, parking, tolls, public transport, ride share."]
["Medical & Health","General Practitioners, Medical Specialists, Optical, Dental, Pharmacy "]
["Education (excluding Private School Fees)","Public school fees, books, uniforms, camps, etc. Training fees, higher education, vocational training."]
["Education - Private School Fees *","Private school fees and costs."]
["Childcare","Day Care, Kindergarten, Baby Sitting, etc (Childcare payments after rebate)."]
["Insurance (excluding Private Health, Life and IP)","Home, contents, vehicle insurance, pet, general property insurance"]
["Private Health, Life and IP Insurance *","Private Health, Life, Total Permanent Disability (TPD), Income Protection (IP) (not included in super fund) "]
["Telephone, Internet, Pay TV & Media Streaming","Telephone, internet, pay TV, media streaming (netflix, spotify, etc)"]
["Recreation & Entertainment","Eating out, takeaway food and drinks, alcohol, tobacco products, concerts, movies, gambling, purchase and hire of recreational / sports items, holidays."]
[]
["Memberships ","Gym, sporting clubs, subscriptions."]
["Non-Complusory Superannuation *","Additonal superannuation contributions."]
["Maintenance *","Child support for non-dependent children, maintenance payments to ex-partners."]
["Other Living Expenses","All other expenses not accounted for in above categories."]
["Other Commitments"]
["For owner occupied and investment loans, enter the current outstanding balance and the actual monthly repayment amount e.g. interest only or principal and interest. "]
["For loans which are in advance / have redraw available, enter the total debt that the loan can be drawn up to (balance + redraw)."]
["For Lines of Credit  / Overdrafts, enter the approved facility limit and the contracted monthly repayment amount."]
["For Personal Loans, enter the current outstanding balance and the monthly repayment amount. "]
["For Credit Cards, enter the approved card limit. (The calculator will adopt 3.8% of the total limit as a repayment amount, regardless of the outstanding balance). "]
["Rent / Board: If the applicant is currently residing in a rental property and will continue to do so after settlement, enter the current monthly rental expense. "]
["Loan Details"]
["New Loan Amount","Enter the proposed new ORDE Financial loan amount"]
["Interest Rate:","Enter the relevant product interest rate (as per Product Guide) "]
["Repayment Type:","Select relevant repayment type - Amortising or Bullet"]
[null,"- Amortising: Principal (post Interest Only period) repaid over the life of the loan"]
[null," - Bullet: Interest Only for the life of the loan, Principal to be repaid at loan maturity"]
["Loan Term (Years):","Enter the requested Loan Term"]
["Interest Only Term (Years): ","If seeking an initial interest only period, enter the number of years "]

{"sheet":"LeaseDocGuide","index":4,"n_rows":20,"n_cols":2,"rows_kept":20,"hidden":true,"merged":[[0,0,3,11]]}
[]
[]
[]
[]
[]
["User Guide"]
[]
["Lease Doc Serviceability Calculator"]
["Application Name:","Enter the applicants name"]
["Application #:","Enter the application number (if known)"]
[]
["Loan Details"]
["Monthly Net Rental Income (Security):","Enter the lower of the Net Market Rental (as confirmed by valuation) or the agreed Lease Income"]
["New Loan Amount","Enter the proposed new ORDE Financial loan amount"]
["Repayment Type:","Select Amortising or Bullet"]
[null,"- Amortising: Principal (post Interest Only period) repaid over the life of the loan"]
[null," - Bullet: Interest Only for the life of the loan, Principal to be repaid at loan maturity"]
["Interest Rate:","Enter the relevant product interest rate (as per Product Guide) "]
["Loan Term (Years):","Enter the requested Loan Term"]
["Interest Only Term (Years): ","If seeking an initial interest only period, enter the number of years "]

{"sheet":"Residential","index":5,"n_rows":131,"n_cols":14,"rows_kept":131,"hidden":true,"merged":[[0,2,1,10],[2,0,2,8],[2,10,2,12],[4,2,4,6],[6,0,6,13],[28,0,28,13],[40,0,40,2],[44,0,44,2],[45,0,45,2],[46,0,46,2],[47,0,47,2],[48,0,48,2],[49,0,49,2],[50,0,50,2],[51,0,51,2],[52,0,52,2],[53,0,53,2],[54,0,54,2],[55,0,55,2],[56,0,56,2],[57,0,57,2],[58,0,58,2],[59,0,59,2],[60,0,60,2],[62,0,62,2],[65,0,65,2],[66,0,66,2],[69,2,69,4],[69,6,69,8],[69,10,69,12],[85,0,85,2],[86,0,86,2],[105,8,106,8],[108,8,110,12],[112,0,113,13]]}
[]
[]
[" Residential Serviceability Calculator",{"$nulls":9},{"$f":"Menu!A6","v":"Version 1.18 (1 September 2023)"}]
[]
["Application Name:",{"$nulls":7},"Application #:"]
[]
["Income Details"]
[]
["Applicant Details:",null,"Applicant 1",null,"Applicant 2",null,"Applicant 3",null,"Applicant 4",null,"Applicant 5",null,"Applicant 6"]
["Status",null,"n/a",null,"n/a",null,"n/a",null,"n/a",null,"n/a",null,"n/a"]
["Household"]
[null,null,{"$f":"C123","v":""},null,{"$f":"E123","v":""},null,{"$f":"G123","v":""},null,{"$f":"I123","v":""},null,{"$f":"K123","v":""},null,{"$f":"M123","v":""}]
["Individual"]
["HECS/HELP Debt",null,"No",null,"No",null,"No",null,"No",null,"No",null,"No"]
["Gross Annual Income",null,0,null,0,null,0,null,0,null,0,null,0]
["Annual Non-Taxable Income",null,0,null,0,null,0,null,0,null,0,null,0]
[]
["Annual Gross Rental Income",null,0,null,0,null,0,null,0,null,0,null,0]
["Annual Investment Property Interest (Negative Gearing)",null,0,null,0,null,0,null,0,null,0,null,0]
["Annual Investment property utilities, rates & costs",null,0,null,0,null,0,null,0,null,0,null,0]
["Company"]
["NPBT",null,0,null,0,null,0,null,0,null,0,null,0]
["Addbacks",null,0,null,0,null,0,null,0,null,0,null,0]
["Annual Gross Rental Income (not included in NPBT)",null,0,null,0,null,0,null,0,null,0,null,0]
[null,null,{"$f":"((C15+C16)/12)+((C22+C23+(C24))/12)+(C18/12)","v":0},null,{"$f":"((E15+E16)/12)+((E22+E23+(E24))/12)+(E18/12)","v":0},null,{"$f":"((G15+G16)/12)+((G22+G23+(G24))/12)+(G18/12)","v":0},null,{"$f":"((I15+I16)/12)+((I22+I23+(I24))/12)+(I18/12)","v":0},null,{"$f":"((K15+K16)/12)+((K22+K23+(K24))/12)+(K18/12)","v":0},null,{"$f":"((M15+M16)/12)+((M22+M23+(M24))/12)+(M18/12)","v":0}]
["Total Income (Monthly)",null,{"$f":"((C15+C16)/12)+((C22+C23+(C24*'Tax Tables'!$D$1))/12)+(C18/12*'Tax Tables'!$D$1)","v":0},null,{"$f":"((E15+E16)/12)+((E22+E23+(E24*'Tax Tables'!$D$1))/12)+(E18/12*'Tax Tables'!$D$1)","v":0},null,{"$f":"((G15+G16)/12)+((G22+G23+(G24*'Tax Tables'!$D$1))/12)+(G18/12*'Tax Tables'!$D$1)","v":0},null,{"$f":"((I15+I16)/12)+((I22+I23+(I24*'Tax Tables'!$D$1))/12)+(I18/12*'Tax Tables'!$D$1)","v":0},null,{"$f":"((K15+K16)/12)+((K22+K23+(K24*'Tax Tables'!$D$1))/12)+(K18/12*'Tax Tables'!$D$1)","v":0},null,{"$f":"((M15+M16)/12)+((M22+M23+(M24*'Tax Tables'!$D$1))/12)+(M18/12*'Tax Tables'!$D$1)","v":0}]
["Net Income (Monthly)",null,{"$f":"IF(C10=\"Company\",C26-('Tax Tables'!H42/12)-((C20)/12),IF(C14=\"No\",C26-('Tax Tables'!H42/12)-((C22+(C24*'Tax Tables'!$D$1)+C23)*'Tax Tables'!$D$2/12)-((C20)/12),C26-('Tax Tables'!H65/12)-((C22+(C24*'Tax Tables'!$D$1)+C23)*'Tax Tables'!$D$2/12)-((C20)/12)))","v":0},null,{"$f":"IF(E10=\"Company\",E26-('Tax Tables'!J42/12)-((E20)/12),IF(E14=\"No\",E26-('Tax Tables'!J42/12)-((E22+(E24*'Tax Tables'!$D$1)+E23)*'Tax Tables'!$D$2/12)-((E20)/12),E26-('Tax Tables'!J65/12)-((E22+(E24*'Tax Tables'!$D$1)+E23)*'Tax Tables'!$D$2/12)-((E20)/12)))","v":0},null,{"$f":"IF(G10=\"Company\",G26-('Tax Tables'!L42/12)-((G20)/12),IF(G14=\"No\",G26-('Tax Tables'!L42/12)-((G22+(G24*'Tax Tables'!$D$1)+G23)*'Tax Tables'!$D$2/12)-((G20)/12),G26-('Tax Tables'!L65/12)-((G22+(G24*'Tax Tables'!$D$1)+G23)*'Tax Tables'!$D$2/12)-((G20)/12)))","v":0},null,{"$f":"IF(I10=\"Company\",I26-('Tax Tables'!N42/12)-((I20)/12),IF(I14=\"No\",I26-('Tax Tables'!N42/12)-((I22+(I24*'Tax Tables'!$D$1)+I23)*'Tax Tables'!$D$2/12)-((I20)/12),I26-('Tax Tables'!N65/12)-((I22+(I24*'Tax Tables'!$D$1)+I23)*'Tax Tables'!$D$2/12)-((I20)/12)))","v":0},null,{"$f":"IF(K10=\"Company\",K26-('Tax Tables'!P42/12)-((K20)/12),IF(K14=\"No\",K26-('Tax Tables'!P42/12)-((K22+(K24*'Tax Tables'!$D$1)+K23)*'Tax Tables'!$D$2/12)-((K20)/12),K26-('Tax Tables'!P65/12)-((K22+(K24*'Tax Tables'!$D$1)+K23)*'Tax Tables'!$D$2/12)-((K20)/12)))","v":0},null,{"$f":"IF(M10=\"Company\",M26-('Tax Tables'!R42/12)-((M20)/12),IF(M14=\"No\",M26-('Tax Tables'!R42/12)-((M22+(M24*'Tax Tables'!$D$1)+M23)*'Tax Tables'!$D$2/12)-((M20)/12),M26-('Tax Tables'!R65/12)-((M22+(M24*'Tax Tables'!$D$1)+M23)*'Tax Tables'!$D$2/12)-((M20)/12)))","v":0}]
[]
["Living Expenses (Per Month) - All living expenses must be completed. Where an amount is $0, further explanation is required"]
["Household",{"$nulls":3},1,{"$nulls":3},2,{"$nulls":3},3]
["Household Status",{"$nulls":3},{"$f":"IF(E30=$C$11,$C$10,IF(E30=$E$11,$E$10,IF(E30=$G$11,$G$10,IF(E30=$I$11,$I$10,IF(E30=$K$11,$K$10,IF(E30=$M$11,$M$10,\"\"))))))","v":""},{"$nulls":3},{"$f":"IF(I30=$C$11,$C$10,IF(I30=$E$11,$E$10,IF(I30=$G$11,$G$10,IF(I30=$I$11,$I$10,IF(I30=$K$11,$K$10,IF(I30=$M$11,$M$10,\"\"))))))","v":""},{"$nulls":3},{"$f":"IF(M30=$C$11,$C$10,IF(M30=$E$11,$E$10,IF(M30=$G$11,$G$10,IF(M30=$I$11,$I$10,IF(M30=$K$11,$K$10,IF(M30=$M$11,$M$10,\"\"))))))","v":""}]
["Status ID",{"$nulls":3},{"$f":"IFERROR(VLOOKUP(E31,List!$B$1:$C$5,2,FALSE),\"\")","v":""},{"$nulls":3},{"$f":"IFERROR(VLOOKUP(I31,List!$B$1:$C$5,2,FALSE),\"\")","v":""},{"$nulls":3},{"$f":"IFERROR(VLOOKUP(M31,List!$B$1:$C$5,2,FALSE),\"\")","v":""}]
["Dependents",{"$nulls":3},{"$f":"E43","v":0},{"$nulls":3},{"$f":"I43","v":0},{"$nulls":3},{"$f":"M43","v":0}]
["HEMID",{"$nulls":3},{"$f":"E32&E33","v":"0"},{"$nulls":3},{"$f":"I32&I33","v":"0"},{"$nulls":3},{"$f":"M32&M33","v":"0"}]
["HouseholdIncome",{"$nulls":3},{"$f":"(SUMIF($C$11:$M$11,E30,$C$26:$M$26)*12)-(SUMIF(C11:M11,E30,C19:M19))-(SUMIF(C11:M11,E30,C20:M20))","v":0},{"$nulls":3},{"$f":"(SUMIF($C$11:$M$11,I30,$C$26:$M$26)*12)-(SUMIF(C11:M11,I30,C19:M19))-(SUMIF(C11:M11,I30,C20:M20))","v":0},{"$nulls":3},{"$f":"(SUMIF($C$11:$M$11,M30,$C$26:$M$26)*12)-(SUMIF(C11:M11,M30,C19:M19))-(SUMIF(C11:M11,M30,C20:M20))","v":0}]
["HEM",{"$nulls":3},{"$f":"IFERROR(HLOOKUP(E35,HEM!$B$20:$P$21,2,TRUE)+1,\"\")","v":2},{"$nulls":3},{"$f":"IFERROR(HLOOKUP(I35,HEM!$B$20:$P$21,2,TRUE)+1,\"\")","v":2},{"$nulls":3},{"$f":"IFERROR(HLOOKUP(M35,HEM!$B$20:$P$21,2,TRUE)+1,\"\")","v":2}]
["HEM Amount",{"$nulls":3},{"$f":"IFERROR(VLOOKUP(E34,HEM!$B$22:$P$37,Residential!E36,FALSE)*52/12,\"\")","v":""},{"$nulls":3},{"$f":"IFERROR(VLOOKUP(I34,HEM!$B$22:$P$37,Residential!I36,FALSE)*52/12,\"\")","v":""},{"$nulls":3},{"$f":"IFERROR(VLOOKUP(M34,HEM!$B$22:$P$37,Residential!M36,FALSE)*52/12,\"\")","v":""}]
["Declared living expenses exculding non HEM",{"$nulls":3},{"$f":"E45+E47+E48+E49+E50+E51+E53+E54+E56+E57+E58+E61","v":0},{"$nulls":3},{"$f":"I45+I47+I48+I49+I50+I51+I53+I54+I56+I57+I58+I61","v":0},{"$nulls":3},{"$f":"M45+M47+M48+M49+M50+M51+M53+M54+M56+M57+M58+M61","v":0}]
[{"$nulls":4},{"$f":"IFERROR(E38/E37,\"\")","v":""},{"$nulls":3},{"$f":"IFERROR(I38/I37,\"\")","v":""},{"$nulls":3},{"$f":"IFERROR(M38/M37,\"\")","v":""}]
[{"v":0.15,"d":"15%"},null,{"$f":"IFERROR(((E37)*(1+A40))+E52+E55+E60+E59,0)","v":0},null,{"$f":"IFERROR(E63-E66,0)","v":0},null,{"$f":"IFERROR(((I37)*(1+A40))+I52+I55+I60+I59,0)","v":0},null,{"$f":"IFERROR(I63-I66,0)","v":0},null,{"$f":"IFERROR(((M37)*(1+A40))+M52+M55+M60+M59,0)","v":0},null,{"$f":"IFERROR(M63-M66,0)","v":0}]
[]
[{"$nulls":4},"Household 1",{"$nulls":3},"Household 2",{"$nulls":3},"Household 3"]
[null,null,"Dependents",null,0,{"$nulls":3},0,{"$nulls":3},0]
[]
["Primary Residence property utilities, rates & costs",{"$nulls":3},0,{"$nulls":3},0,{"$nulls":3},0]
["Investment property utilities, rates & costs *",{"$nulls":3},0,{"$nulls":3},0,{"$nulls":3},0]
["Groceries",{"$nulls":3},0,{"$nulls":3},0,{"$nulls":3},0]
["Clothing & Personal Care",{"$nulls":3},0,{"$nulls":3},0,{"$nulls":3},0]
["Transport",{"$nulls":3},0,{"$nulls":3},0,{"$nulls":3},0]
["Medical & Health",{"$nulls":3},0,{"$nulls":3},0,{"$nulls":3},0]
["Education (excluding Private School Fees)",{"$nulls":3},0,{"$nulls":3},0,{"$nulls":3},0]
["Education - Private School Fees *",{"$nulls":3},0,{"$nulls":3},0,{"$nulls":3},0]
["Childcare",{"$nulls":3},0,{"$nulls":3},0,{"$nulls":3},0]
["Insurance (excluding Private Health, Life and IP)",{"$nulls":3},0,{"$nulls":3},0,{"$nulls":3},0]
["Private Health, Life and IP Insurance *",{"$nulls":3},0,{"$nulls":3},0,{"$nulls":3},0]
["Telephone, Internet, Pay TV & Media Streaming",{"$nulls":3},0,{"$nulls":3},0,{"$nulls":3},0]
["Recreation & Entertainment",{"$nulls":3},0,{"$nulls":3},0,{"$nulls":3},0]
["Memberships (gym, sporting clubs etc)",{"$nulls":3},0,{"$nulls":3},0,{"$nulls":3},0]
["Non-Compulsory Superannuation *",{"$nulls":3},0,{"$nulls":3},0,{"$nulls":3},0]
["Maintenance *",{"$nulls":3},0,{"$nulls":3},0,{"$nulls":3},0]
["Other Living Expenses",{"$nulls":3},0,{"$nulls":3},0,{"$nulls":3},0]
[]
["Total Monthly Living Expenses Declared (HEM & non-HEM)",{"$nulls":3},{"$f":"SUM(E45:E61)","v":0},{"$nulls":3},{"$f":"SUM(I45:I61)","v":0},{"$nulls":3},{"$f":"SUM(M45:M61)","v":0}]
[{"$nulls":4},{"$f":"C127","v":""},{"$nulls":3},{"$f":"E127","v":""},{"$nulls":3},{"$f":"G127","v":""}]
[]
["HEM Living Expense",{"$nulls":3},{"$f":"E37","v":""},{"$nulls":3},{"$f":"I37","v":""},{"$nulls":3},{"$f":"M37","v":""}]
["Monthly Living Expenses Used",{"$nulls":3},{"$f":"MAX(E37:E38)+E46+E52+E55+E60+E59","v":0},{"$nulls":3},{"$f":"MAX(I37:I38)+I46+I52+I55+I60+I59","v":0},{"$nulls":3},{"$f":"MAX(M37:M38)+M46+M52+M55+M60+M59","v":0}]
[]
["Other Commitments"]
[null,null,"Household 1 / Company 1",{"$nulls":3},"Household 2 / Company 2",{"$nulls":3},"Household 3 / Company 3"]
[null,null,"Debt / Limit",null,"Repayment",null,"Debt / Limit",null,"Repayment",null,"Debt / Limit",null,"Repayment"]
["Owner Occupied Property 1",null,0,{"$f":"IFERROR(RATE(360,SUM(E72),SUM(C72)*-1,0,0,0.1)*12,0)","v":{"v":0,"d":"0.0%"}},0,{"$f":"IF((D72+List!$B$13)>=List!$B$16,(PMT((D72+List!$B$13)/12,360,SUM(Residential!C72),0,0)*-1)-SUM(E72),(PMT((List!$B$16)/12,360,SUM(Residential!C72),0,0)*-1)-SUM(E72))","v":0},0,{"$f":"IFERROR(RATE(360,SUM(I72),SUM(G72)*-1,0,0,0.1)*12,0)","v":{"v":0,"d":"0.0%"}},0,{"$f":"IF((H72+List!$B$13)>=List!$B$16,(PMT((H72+List!$B$13)/12,360,SUM(Residential!G72),0,0)*-1)-SUM(I72),(PMT((List!$B$16)/12,360,SUM(Residential!G72),0,0)*-1)-SUM(I72))","v":0},0,{"$f":"IFERROR(RATE(360,SUM(M72),SUM(K72)*-1,0,0,0.1)*12,0)","v":{"v":0,"d":"0.0%"}},0,{"$f":"IF((L72+List!$B$13)>=List!$B$16,(PMT((L72+List!$B$13)/12,360,SUM(Residential!K72),0,0)*-1)-SUM(M72),(PMT((List!$B$16)/12,360,SUM(Residential!K72),0,0)*-1)-SUM(M72))","v":0}]
["Owner Occupied Property 2",null,0,{"$f":"IFERROR(RATE(360,SUM(E73),SUM(C73)*-1,0,0,0.1)*12,0)","v":{"v":0,"d":"0.0%"}},0,{"$f":"IF((D73+List!$B$13)>=List!$B$16,(PMT((D73+List!$B$13)/12,360,SUM(Residential!C73),0,0)*-1)-SUM(E73),(PMT((List!$B$16)/12,360,SUM(Residential!C73),0,0)*-1)-SUM(E73))","v":0},0,{"v":0,"d":"0.0%"},0,{"$f":"IF((H73+List!$B$13)>=List!$B$16,(PMT((H73+List!$B$13)/12,360,SUM(Residential!G73),0,0)*-1)-SUM(I73),(PMT((List!$B$16)/12,360,SUM(Residential!G73),0,0)*-1)-SUM(I73))","v":0},0,{"v":0,"d":"0.0%"},0,{"$f":"IF((L73+List!$B$13)>=List!$B$16,(PMT((L73+List!$B$13)/12,360,SUM(Residential!K73),0,0)*-1)-SUM(M73),(PMT((List!$B$16)/12,360,SUM(Residential!K73),0,0)*-1)-SUM(M73))","v":0}]
["Investment Property 1",null,0,{"v":0,"d":"0.0%"},0,{"$f":"IF((D74+List!$B$13)>=List!$B$16,(PMT((D74+List!$B$13)/12,360,SUM(Residential!C74),0,0)*-1)-SUM(E74),(PMT((List!$B$16)/12,360,SUM(Residential!C74),0,0)*-1)-SUM(E74))","v":0},0,{"v":0,"d":"0.0%"},0,{"$f":"IF((H74+List!$B$13)>=List!$B$16,(PMT((H74+List!$B$13)/12,360,SUM(Residential!G74),0,0)*-1)-SUM(I74),(PMT((List!$B$16)/12,360,SUM(Residential!G74),0,0)*-1)-SUM(I74))","v":0},0,{"v":0,"d":"0.0%"},0,{"$f":"IF((L74+List!$B$13)>=List!$B$16,(PMT((L74+List!$B$13)/12,360,SUM(Residential!K74),0,0)*-1)-SUM(M74),(PMT((List!$B$16)/12,360,SUM(Residential!K74),0,0)*-1)-SUM(M74))","v":0}]
["Investment Property 2",null,0,{"v":0,"d":"0.0%"},0,{"$f":"IF((D75+List!$B$13)>=List!$B$16,(PMT((D75+List!$B$13)/12,360,SUM(Residential!C75),0,0)*-1)-SUM(E75),(PMT((List!$B$16)/12,360,SUM(Residential!C75),0,0)*-1)-SUM(E75))","v":0},0,{"v":0,"d":"0.0%"},0,{"$f":"IF((H75+List!$B$13)>=List!$B$16,(PMT((H75+List!$B$13)/12,360,SUM(Residential!G75),0,0)*-1)-SUM(I75),(PMT((List!$B$16)/12,360,SUM(Residential!G75),0,0)*-1)-SUM(I75))","v":0},0,{"v":0,"d":"0.0%"},0,{"$f":"IF((L75+List!$B$13)>=List!$B$16,(PMT((L75+List!$B$13)/12,360,SUM(Residential!K75),0,0)*-1)-SUM(M75),(PMT((List!$B$16)/12,360,SUM(Residential!K75),0,0)*-1)-SUM(M75))","v":0}]
["Investment Property 3",null,0,{"v":0,"d":"0.0%"},0,{"$f":"IF((D76+List!$B$13)>=List!$B$16,(PMT((D76+List!$B$13)/12,360,SUM(Residential!C76),0,0)*-1)-SUM(E76),(PMT((List!$B$16)/12,360,SUM(Residential!C76),0,0)*-1)-SUM(E76))","v":0},0,{"v":0,"d":"0.0%"},0,{"$f":"IF((H76+List!$B$13)>=List!$B$16,(PMT((H76+List!$B$13)/12,360,SUM(Residential!G76),0,0)*-1)-SUM(I76),(PMT((List!$B$16)/12,360,SUM(Residential!G76),0,0)*-1)-SUM(I76))","v":0},0,{"v":0,"d":"0.0%"},0,{"$f":"IF((L76+List!$B$13)>=List!$B$16,(PMT((L76+List!$B$13)/12,360,SUM(Residential!K76),0,0)*-1)-SUM(M76),(PMT((List!$B$16)/12,360,SUM(Residential!K76),0,0)*-1)-SUM(M76))","v":0}]
["Investment Property 4",null,0,{"v":0,"d":"0.0%"},0,{"$f":"IF((D77+List!$B$13)>=List!$B$16,(PMT((D77+List!$B$13)/12,360,SUM(Residential!C77),0,0)*-1)-SUM(E77),(PMT((List!$B$16)/12,360,SUM(Residential!C77),0,0)*-1)-SUM(E77))","v":0},0,{"v":0,"d":"0.0%"},0,{"$f":"IF((H77+List!$B$13)>=List!$B$16,(PMT((H77+List!$B$13)/12,360,SUM(Residential!G77),0,0)*-1)-SUM(I77),(PMT((List!$B$16)/12,360,SUM(Residential!G77),0,0)*-1)-SUM(I77))","v":0},0,{"v":0,"d":"0.0%"},0,{"$f":"IF((L77+List!$B$13)>=List!$B$16,(PMT((L77+List!$B$13)/12,360,SUM(Residential!K77),0,0)*-1)-SUM(M77),(PMT((List!$B$16)/12,360,SUM(Residential!K77),0,0)*-1)-SUM(M77))","v":0}]
["Other Liabilities 1",null,0,null,0,null,0,null,0,null,0,null,0]
["Other Liabilities 2",null,0,null,0,null,0,null,0,null,0,null,0]
["Other Liabilities (Fixed)",null,0,null,0,null,0,null,0,null,0,null,0]
["Credit Card 1",null,0,null,{"$f":"C81*HEM!$C$1","v":0},null,0,null,{"$f":"G81*HEM!$C$1","v":0},null,0,null,{"$f":"K81*HEM!$C$1","v":0}]
["Credit Card 2",null,0,null,{"$f":"C82*HEM!$C$1","v":0},null,0,null,{"$f":"G82*HEM!$C$1","v":0},null,0,null,{"$f":"K82*HEM!$C$1","v":0}]
[{"$nulls":4},{"$f":"SUMIF(F72:F77,\">0\",F72:F77)","v":0},{"$nulls":3},{"$f":"SUMIF(J72:J77,\">0\",J72:J77)","v":0},{"$nulls":3},{"$f":"SUMIF(N72:N77,\">0\",N72:N77)","v":0}]
["Rent/Board",{"$nulls":3},0,{"$nulls":3},0,{"$nulls":3},0]
[]
["TOTAL EXISTING COMMITMENTS",{"$nulls":3},{"$f":"SUM(E72:E82)+E84","v":0},{"$nulls":3},{"$f":"SUM(I72:I82)+I84","v":0},{"$nulls":3},{"$f":"SUM(M72:M82)+M84","v":0}]
["TOTAL ASSESSED EXISTING COMMITMENTS",{"$nulls":3},{"$f":"E83+E86","v":0},{"$nulls":3},{"$f":"I83+I86","v":0},{"$nulls":3},{"$f":"M83+M86","v":0}]
[]
["Loan Details"]
["Application #",null,"App# 1",null,"App# 2",null,"App# 3",null,"App# 4",null,"App# 5",null,"App# 6"]
["New Loan Amount",null,0,null,0,null,0,null,0,null,0,null,0]
["Repayment Type",null,"Amortising",null,"Amortising",null,"Amortising",null,"Amortising",null,"Amortising",null,"Amortising"]
["Loan Term (Years)",null,30,null,30,null,30,null,30,null,30,null,30]
["Interest Only Term (Years)",null,0,null,0,null,0,null,0,null,0,null,0]
[]
["Interest Rate",null,{"v":0.05,"d":"5.00%"},null,{"v":0.05,"d":"5.00%"},null,{"v":0.05,"d":"5.00%"},null,{"v":0.05,"d":"5.00%"},null,{"v":0.05,"d":"5.00%"},null,{"v":0.05,"d":"5.00%"}]
["Sensitivity",null,{"$f":"MAX(List!B15:B16)-C96","v":{"v":0.020000000000000004,"d":"2.00%"}},null,{"$f":"MAX(List!C15:C16)-E96","v":{"v":0.020000000000000004,"d":"2.00%"}},null,{"$f":"MAX(List!D15:D16)-G96","v":{"v":0.020000000000000004,"d":"2.00%"}},null,{"$f":"MAX(List!E15:E16)-I96","v":{"v":0.020000000000000004,"d":"2.00%"}},null,{"$f":"MAX(List!F15:F16)-K96","v":{"v":0.020000000000000004,"d":"2.00%"}},null,{"$f":"MAX(List!G15:G16)-M96","v":{"v":0.020000000000000004,"d":"2.00%"}}]
["Assessment Rate",null,{"$f":"C96+C97","v":{"v":0.07,"d":"7.00%"}},null,{"$f":"E96+E97","v":{"v":0.07,"d":"7.00%"}},null,{"$f":"G96+G97","v":{"v":0.07,"d":"7.00%"}},null,{"$f":"I96+I97","v":{"v":0.07,"d":"7.00%"}},null,{"$f":"K96+K97","v":{"v":0.07,"d":"7.00%"}},null,{"$f":"M96+M97","v":{"v":0.07,"d":"7.00%"}}]
[]
["Monthly Loan Repayment",null,{"$f":"IFERROR(IF(C92=\"Amortising\",-PMT(C96/12,(C93-C94)*12,C91,0,0),C91*C96/12),\"\")","v":0},null,{"$f":"IFERROR(IF(E92=\"Amortising\",-PMT(E96/12,(E93-E94)*12,E91,0,0),E91*E96/12),\"\")","v":0},null,{"$f":"IFERROR(IF(G92=\"Amortising\",-PMT(G96/12,(G93-G94)*12,G91,0,0),G91*G96/12),\"\")","v":0},null,{"$f":"IFERROR(IF(I92=\"Amortising\",-PMT(I96/12,(I93-I94)*12,I91,0,0),I91*I96/12),\"\")","v":0},null,{"$f":"IFERROR(IF(K92=\"Amortising\",-PMT(K96/12,(K93-K94)*12,K91,0,0),K91*K96/12),\"\")","v":0},null,{"$f":"IFERROR(IF(M92=\"Amortising\",-PMT(M96/12,(M93-M94)*12,M91,0,0),M91*M96/12),\"\")","v":0}]
["Monthly Assessed Repayment",null,{"$f":"IFERROR(IF(C92=\"Amortising\",-PMT(C98/12,(C93-C94)*12,C91,0,0),C91*C98/12),\"\")","v":0},null,{"$f":"IFERROR(IF(E92=\"Amortising\",-PMT(E98/12,(E93-E94)*12,E91,0,0),E91*E98/12),\"\")","v":0},null,{"$f":"IFERROR(IF(G92=\"Amortising\",-PMT(G98/12,(G93-G94)*12,G91,0,0),G91*G98/12),\"\")","v":0},null,{"$f":"IFERROR(IF(I92=\"Amortising\",-PMT(I98/12,(I93-I94)*12,I91,0,0),I91*I98/12),\"\")","v":0},null,{"$f":"IFERROR(IF(K92=\"Amortising\",-PMT(K98/12,(K93-K94)*12,K91,0,0),K91*K98/12),\"\")","v":0},null,{"$f":"IFERROR(IF(M92=\"Amortising\",-PMT(M98/12,(M93-M94)*12,M91,0,0),M91*M98/12),\"\")","v":0}]
[]
["Results"]
[]
[null,null,"Monthly"]
["Net Income",null,{"$f":"SUM(C27:M27)","v":0},null,"Net Surplus Income:",null,{"$f":"IFERROR(C106-C107-C108-C109,\"\")","v":0},null,{"$f":"IFERROR(IF(G106>0,IF(G107>1,\"PASS\",\"FAIL\"),\"FAIL\"),\"\")","v":"FAIL"}]
["Living Expenses",null,{"$f":"E67+I67+M67","v":0},null,"Debt Service Ratio:",null,{"$f":"IFERROR(C106/SUM(C107:C109),\"\")","v":""}]
["Existing Commitments",null,{"$f":"E87+I87+M87","v":0},null,"Debt To Income:",null,{"$f":"IFERROR((SUM(C72:C82)+SUM(G72:G82)+SUM(K72:K82)+C91+E91+G91+I91+K91+M91)/(SUM(C25:M25)*12),\"\")","v":""}]
["Proposed Repayments",null,{"$f":"C101+E101+G101+I101+K101+M101","v":0},null,"Maximum Loan*:",null,{"$f":"IFERROR(IF(C92=\"Amortising\",FLOOR(-PV((C98)/12,(C93-C94)*12,(C106-C107-C108),0,0),100),\"N/A\"),\"\")","v":0},null,{"$f":"K131","v":""}]
[{"$nulls":4},{"$f":"\"* based on \"&C90&\" details\"","v":"* based on App# 1 details"}]
[]
[]
[{"$f":"Menu!A21","v":"The information contained in this calculator is provided by LoanOne Pty Ltd ACN  161 283 147, Australian Credit License 501182 for illustrative purposes only and should not be regarded as a prediction, or as personal advice. Calculations are not forecasts or projections but is a tool that may assist you to make your own projections. The calculator is not intended to be a substitute for professional advice. The information in this calculator does not constitute an offer to lend, or imply the product is suitable for clients. Before acting on this general information, your client must consider its appropriateness having regard to their own objectives, financial situation and need and also seek independent financial, legal and taxation advice. No guarantee, warranty, or representation is given or implied as to the reliability or accuracy of the information use to compile each index or each calculation. LoanOne specifically disclaims any liability for any direct, indirect, incidental, consequential, or special damages or for any loss arising out of or in any way connected with the access to, reliance on, or use of this calculator."}]
[]
[]
[]
["Count",null,{"$f":"COUNTIF($C$11:$M$11,C11)","v":0},null,{"$f":"COUNTIF($C$11:$M$11,E11)","v":0},null,{"$f":"COUNTIF($C$11:$M$11,G11)","v":0},null,{"$f":"COUNTIF($C$11:$M$11,I11)","v":0},null,{"$f":"COUNTIF($C$11:$M$11,K11)","v":0},null,{"$f":"COUNTIF($C$11:$M$11,M11)","v":0}]
[]
["Individual (Single)",null,{"$f":"IF(C10=\"Individual (Single)\",IF(C117=1,\"\",IF(C117>1,\"Only 1 Household per Single Applicant\",\"Applicant needs to be assigned a Household\")))","v":false},null,{"$f":"IF(E10=\"Individual (Single)\",IF(E117=1,\"\",IF(E117>1,\"Only 1 Household per Single Applicant\",\"Applicant needs to be assigned a Household\")))","v":false},null,{"$f":"IF(G10=\"Individual (Single)\",IF(G117=1,\"\",IF(G117>1,\"Only 1 Household per Single Applicant\",\"Applicant needs to be assigned a Household\")))","v":false},null,{"$f":"IF(I10=\"Individual (Single)\",IF(I117=1,\"\",IF(I117>1,\"Only 1 Household per Single Applicant\",\"Applicant needs to be assigned a Household\")))","v":false},null,{"$f":"IF(K10=\"Individual (Single)\",IF(K117=1,\"\",IF(K117>1,\"Only 1 Household per Single Applicant\",\"Applicant needs to be assigned a Household\")))","v":false},null,{"$f":"IF(M10=\"Individual (Single)\",IF(M117=1,\"\",IF(M117>1,\"Only 1 Household per Single Applicant\",\"Applicant needs to be assigned a Household\")))","v":false}]
["Individual (Couple)",null,{"$f":"IF(C10=\"Individual (Couple)\",IF(C117=1,\"\",IF(C117=2,\"\",IF(C117>2,\"Only 1 Household per Couple Applicant\",IF(C117<1,\"Applicant needs to be assigned a Household\",)))))","v":false},null,{"$f":"IF(E10=\"Individual (Couple)\",IF(E117=1,\"\",IF(E117=2,\"\",IF(E117>2,\"Only 1 Household per Couple Applicant\",IF(E117<1,\"Applicant needs to be assigned a Household\",)))))","v":false},null,{"$f":"IF(G10=\"Individual (Couple)\",IF(G117=1,\"\",IF(G117=2,\"\",IF(G117>2,\"Only 1 Household per Couple Applicant\",IF(G117<1,\"Applicant needs to be assigned a Household\",)))))","v":false},null,{"$f":"IF(I10=\"Individual (Couple)\",IF(I117=1,\"\",IF(I117=2,\"\",IF(I117>2,\"Only 1 Household per Couple Applicant\",IF(I117<1,\"Applicant needs to be assigned a Household\",)))))","v":false},null,{"$f":"IF(K10=\"Individual (Couple)\",IF(K117=1,\"\",IF(K117=2,\"\",IF(K117>2,\"Only 1 Household per Couple Applicant\",IF(K117<1,\"Applicant needs to be assigned a Household\",)))))","v":false},null,{"$f":"IF(M10=\"Individual (Couple)\",IF(M117=1,\"\",IF(M117=2,\"\",IF(M117>2,\"Only 1 Household per Couple Applicant\",IF(M117<1,\"Applicant needs to be assigned a Household\",)))))","v":false}]
["n/a",null,{"$f":"IF(C10=\"n/a\",IF(C117>0,\"Household should only be applied where an applicant exists\",\"\"))","v":""},null,{"$f":"IF(E10=\"n/a\",IF(E117>0,\"Household should only be applied where an applicant exists\",\"\"))","v":""},null,{"$f":"IF(G10=\"n/a\",IF(G117>0,\"Household should only be applied where an applicant exists\",\"\"))","v":""},null,{"$f":"IF(I10=\"n/a\",IF(I117>0,\"Household should only be applied where an applicant exists\",\"\"))","v":""},null,{"$f":"IF(K10=\"n/a\",IF(K117>0,\"Household should only be applied where an applicant exists\",\"\"))","v":""},null,{"$f":"IF(M10=\"n/a\",IF(M117>0,\"Household should only be applied where an applicant exists\",\"\"))","v":""}]
["Company",null,{"$f":"IF(C10=\"Company\",IF(C117>0,\"Household should not be applied to a Company Applicant\",\"\"))","v":false},null,{"$f":"IF(E10=\"Company\",IF(E117>0,\"Household should not be applied to a Company Applicant\",\"\"))","v":false},null,{"$f":"IF(G10=\"Company\",IF(G117>0,\"Household should not be applied to a Company Applicant\",\"\"))","v":false},null,{"$f":"IF(I10=\"Company\",IF(I117>0,\"Household should not be applied to a Company Applicant\",\"\"))","v":false},null,{"$f":"IF(K10=\"Company\",IF(K117>0,\"Household should not be applied to a Company Applicant\",\"\"))","v":false},null,{"$f":"IF(M10=\"Company\",IF(M117>0,\"Household should not be applied to a Company Applicant\",\"\"))","v":false}]
["Error Message",null,{"$f":"IFERROR(VLOOKUP(C10,$A$119:$M$122,3,FALSE),\"\")","v":""},null,{"$f":"IFERROR(VLOOKUP(E10,$A$119:$M$122,5,FALSE),\"\")","v":""},null,{"$f":"IFERROR(VLOOKUP(G10,$A$119:$M$122,7,FALSE),\"\")","v":""},null,{"$f":"IFERROR(VLOOKUP(I10,$A$119:$M$122,9,FALSE),\"\")","v":""},null,{"$f":"IFERROR(VLOOKUP(K10,$A$119:$M$122,11,FALSE),\"\")","v":""},null,{"$f":"IFERROR(VLOOKUP(M10,$A$119:$M$122,13,FALSE),\"\")","v":""}]
[]
["Household",null,1,null,2,null,3]
["Household Count",null,{"$f":"COUNTIF($C$11:$M$11,C125)","v":0},null,{"$f":"COUNTIF($C$11:$M$11,E125)","v":0},null,{"$f":"COUNTIF($C$11:$M$11,G125)","v":0}]
["Expense Error",null,{"$f":"IF(C126=0,IF(E38>0,\"Household 1 has not been assigned to an applicant\",\"\"),IF(E38<E37,\"Monthly living expenses are less than benchmark, detailed explanation required\",\"\"))","v":""},null,{"$f":"IF(E126=0,IF(I38>0,\"Household 1 has not been assigned to an applicant\",\"\"),IF(I38<I37,\"Monthly living expenses are less than benchmark, detailed explanation required\",\"\"))","v":""},null,{"$f":"IF(G126=0,IF(M38>0,\"Household 1 has not been assigned to an applicant\",\"\"),IF(M38<M37,\"Monthly living expenses are less than benchmark, detailed explanation required\",\"\"))","v":""}]
["Bank Statements",null,{"$f":"C40+G40+K40","v":0}]
["Bank Statements",null,{"$f":"IFERROR(C106-C128-C108-C109,\"\")","v":0}]
[]
["Error Message",null,{"$f":"IF(C129<0,\"Where borrower/s are individuals, 3 months banks statements / transaction statements required to support loan application\",\"\")","v":""},{"$nulls":7},{"$f":"C131","v":""}]

{"sheet":"Commercial","index":6,"n_rows":130,"n_cols":11,"rows_kept":130,"hidden":true,"merged":[[0,2,1,6],[2,0,2,5],[2,8,2,10],[4,2,4,4],[6,0,6,12],[29,0,29,10],[39,0,39,12],[40,0,40,2],[67,0,67,12],[68,2,68,4],[68,6,68,8],[68,10,68,11],[84,0,84,2],[85,0,85,2],[87,0,87,12],[101,0,101,12],[104,8,105,8],[106,8,108,11],[109,0,109,12],[110,0,110,12]]}
[]
[]
[" Commercial Serviceability Calculator",{"$nulls":7},{"$f":"Menu!A6","v":"Version 1.18 (1 September 2023)"}]
[]
["Application Name:",{"$nulls":5},"Application #:"]
[]
["Income Details"]
[]
["Applicant Details:",null,"Applicant 1",null,"Applicant 2",null,"Applicant 3",null,"Applicant 4",null,"Applicant 5"]
["Status",null,"n/a",null,"n/a",null,"n/a",null,"n/a",null,"n/a"]
["Household"]
[null,null,{"$f":"C120","v":""},null,{"$f":"E120","v":""},null,{"$f":"G120","v":""},null,{"$f":"I120","v":""},null,{"$f":"K120","v":""}]
["Individual"]
["HECS/HELP Debt",null,"No",null,"No",null,"No",null,"No",null,"No"]
["Gross Annual Income",null,0,null,0,null,0,null,0,null,0]
["Annual Non-Taxable Income",null,0,null,0,null,0,null,0,null,0]
[]
["Annual Gross Rental Income",null,0,null,0,null,0,null,0,null,0]
["Investment Property Interest Expense (Negative Gearing)",null,0,null,0,null,0,null,0,null,0]
["Investment property utilities, rates & costs",null,0,null,0,null,0,null,0,null,0]
["Company"]
["Company NPBT",null,0,null,0,null,0,null,0,null,0]
["Addbacks - Interest Paid",null,0,null,0,null,0,null,0,null,0]
["Addbacks - Other",null,0,null,0,null,0,null,0,null,0]
["Annual Gross Rental Income (not included in NPBT)",null,0,null,0,null,0,null,0,null,0]
[]
["Total Income (Monthly)",null,{"$f":"((C15+C16)/12)+((C22+C23+C24)/12)+(C18/12*'Tax Tables (C)'!D1)+(C25/12*'Tax Tables (C)'!D1)","v":0},null,{"$f":"((E15+E16)/12)+((E22+E23+E24)/12)+(E18/12*'Tax Tables'!$D$1)+(E25/12*'Tax Tables'!$D$1)","v":0},null,{"$f":"((G15+G16)/12)+((G22+G23+G24)/12)+(G18/12*'Tax Tables'!$D$1)+(G25/12*'Tax Tables'!$D$1)","v":0},null,{"$f":"((I15+I16)/12)+((I22+I23+I24)/12)+(I18/12*'Tax Tables'!$D$1)+(I25/12*'Tax Tables'!$D$1)","v":0},null,{"$f":"((K15+K16)/12)+((K22+K23+K24)/12)+(K18/12*'Tax Tables'!$D$1)+(K25/12*'Tax Tables'!$D$1)","v":0}]
["Total Net Income (Monthly)",null,{"$f":"IF(C10=\"Company\",C27-('Tax Tables (C)'!H42/12),IF(C14=\"No\",C27-('Tax Tables (C)'!H42/12)-((C22+(C25*'Tax Tables (C)'!$D$1)+C23+C24)*'Tax Tables (C)'!$D$2/12)-((C20)/12),C27-('Tax Tables (C)'!H65/12)-((C22+(C25*'Tax Tables (C)'!$D$1)+C23+C24)*'Tax Tables (C)'!$D$2/12)-((C20)/12)))","v":0},null,{"$f":"IF(E10=\"Company\",E27-('Tax Tables (C)'!J42/12),IF(E14=\"No\",E27-('Tax Tables (C)'!J42/12)-((E22+(E25*'Tax Tables (C)'!$D$1)+E23+E24)*'Tax Tables (C)'!$D$2/12)-((E20)/12),E27-('Tax Tables (C)'!J65/12)-((E22+(E25*'Tax Tables (C)'!$D$1)+E23+E24)*'Tax Tables (C)'!$D$2/12)-((E20)/12)))","v":0},null,{"$f":"IF(G10=\"Company\",G27-('Tax Tables (C)'!L42/12),IF(G14=\"No\",G27-('Tax Tables (C)'!L42/12)-((G22+(G25*'Tax Tables (C)'!$D$1)+G23+G24)*'Tax Tables (C)'!$D$2/12)-((G20)/12),G27-('Tax Tables (C)'!L65/12)-((G22+(G25*'Tax Tables (C)'!$D$1)+G23+G24)*'Tax Tables (C)'!$D$2/12)-((G20)/12)))","v":0},null,{"$f":"IF(I10=\"Company\",I27-('Tax Tables (C)'!N42/12),IF(I14=\"No\",I27-('Tax Tables (C)'!N42/12)-((I22+(I25*'Tax Tables (C)'!$D$1)+I23+I24)*'Tax Tables (C)'!$D$2/12)-((I20)/12),I27-('Tax Tables (C)'!N65/12)-((I22+(I25*'Tax Tables (C)'!$D$1)+I23+I24)*'Tax Tables (C)'!$D$2/12)-((I20)/12)))","v":0},null,{"$f":"IF(K10=\"Company\",K27-('Tax Tables (C)'!P42/12),IF(K14=\"No\",K27-('Tax Tables (C)'!P42/12)-((K22+(K25*'Tax Tables (C)'!$D$1)+K23+K24)*'Tax Tables (C)'!$D$2/12)-((K20)/12),K27-('Tax Tables (C)'!P65/12)-((K22+(K25*'Tax Tables (C)'!$D$1)+K23+K24)*'Tax Tables (C)'!$D$2/12)-((K20)/12)))","v":0}]
[]
["Living Expenses (Per Month) - All living expenses must be completed. Where an amount is $0, further explanation is required"]
["Household",null,1,null,2,null,3]
["Household Status",null,{"$f":"IF(C31=$C$11,$C$10,IF(C31=$E$11,$E$10,IF(C31=$G$11,$G$10,IF(C31=$I$11,$I$10,IF(C31=$K$11,$K$10,IF(C31=#REF!,#REF!,\"\"))))))","v":{"$error":"#REF!"}},null,{"$f":"IF(E31=$C$11,$C$10,IF(E31=$E$11,$E$10,IF(E31=$G$11,$G$10,IF(E31=$I$11,$I$10,IF(E31=$K$11,$K$10,IF(E31=#REF!,#REF!,\"\"))))))","v":{"$error":"#REF!"}},null,{"$f":"IF(G31=$C$11,$C$10,IF(G31=$E$11,$E$10,IF(G31=$G$11,$G$10,IF(G31=$I$11,$I$10,IF(G31=$K$11,$K$10,IF(G31=#REF!,#REF!,\"\"))))))","v":{"$error":"#REF!"}}]
["Status ID",null,{"$f":"IFERROR(VLOOKUP(C32,List!$B$1:$C$5,2,FALSE),\"\")","v":""},null,{"$f":"IFERROR(VLOOKUP(E32,List!$B$1:$C$5,2,FALSE),\"\")","v":""},null,{"$f":"IFERROR(VLOOKUP(G32,List!$B$1:$C$5,2,FALSE),\"\")","v":""},null,"Household 1",null,{"$f":"IFERROR(C63-C65,0)","v":0}]
["Dependents",null,{"$f":"C43","v":0},null,{"$f":"G43","v":0},null,{"$f":"K43","v":0},null,"Household 2",null,{"$f":"IFERROR(G63-G65,0)","v":0}]
["HEMID",null,{"$f":"C33&C34","v":"0"},null,{"$f":"E33&E34","v":"0"},null,{"$f":"G33&G34","v":"0"},null,"Household 3",null,{"$f":"IFERROR(K63-K65,0)","v":0}]
["HouseholdIncome",null,{"$f":"(SUMIF($C$11:$L$11,C31,$C$27:$L$27)*12)-SUMIF($C$11:$L$11,C31,$C$19:$L$19)-SUMIF($C$11:$L$11,C31,$C$20:$L$20)","v":0},null,{"$f":"(SUMIF($C$11:$L$11,E31,$C$27:$L$27)*12)-SUMIF($C$11:$L$11,E31,$C$19:$L$19)-SUMIF($C$11:$L$11,E31,$C$20:$L$20)","v":0},null,{"$f":"(SUMIF($C$11:$L$11,G31,$C$27:$L$27)*12)-SUMIF($C$11:$L$11,G31,$C$19:$L$19)-SUMIF($C$11:$L$11,G31,$C$20:$L$20)","v":0}]
["HEM",null,{"$f":"IFERROR(HLOOKUP(C36,HEM!$B$20:$P$21,2,TRUE)+1,\"\")","v":2},null,{"$f":"IFERROR(HLOOKUP(E36,HEM!$B$20:$P$21,2,TRUE)+1,\"\")","v":2},null,{"$f":"IFERROR(HLOOKUP(G36,HEM!$B$20:$P$21,2,TRUE)+1,\"\")","v":2}]
["HEM Amount",{"$f":"IFERROR((C38*1.15)+C52+C55+C60+C59,0)","v":0},{"$f":"IFERROR(VLOOKUP(C35,HEM!$B$22:$P$37,Commercial!C37,FALSE)*52/12,\"\")","v":""},{"$f":"IFERROR((E38*1.15)+G52+G55+G59+G60,0)","v":0},{"$f":"IFERROR(VLOOKUP(E35,HEM!$B$22:$P$37,Commercial!E37,FALSE)*52/12,\"\")","v":""},{"$f":"IFERROR((G38*1.15)+K52+K55+K59+K60,0)","v":0},{"$f":"IFERROR(VLOOKUP(G35,HEM!$B$22:$P$37,Commercial!G37,FALSE)*52/12,\"\")","v":""}]
["Declared living expenses exculding non HEM",null,{"$f":"C45+C47+C48+C49+C50+C51+C53+C54+C56+C57+C58+C61","v":0},null,{"$f":"G45+G47+G48+G49+G50+G51+G53+G54+G56+G57+G58+G61","v":0},null,{"$f":"K45+K47+K48+K49+K50+K51+K53+K54+K56+K57+K58+K61","v":0}]
["Living Expenses (Per Month) - Only where individual income is required to support servicing",null,{"$f":"IFERROR(C39/C38,\"\")","v":""},null,{"$f":"IFERROR(E39/E38,\"\")","v":""},null,{"$f":"IFERROR(G39/G38,\"\")","v":""}]
[]
[null,null,"Household 1",{"$nulls":3},"Household 2",{"$nulls":3},"Household 3"]
["Dependents",null,0,{"$nulls":3},0,{"$nulls":3},0]
[]
["Primary Residence property utilities, rates & costs",null,0,{"$nulls":3},0,{"$nulls":3},0]
["Investment property utilities, rates & costs *",null,0,{"$nulls":3},0,{"$nulls":3},0]
["Groceries",null,0,{"$nulls":3},0,{"$nulls":3},0]
["Clothing & Personal Care",null,0,{"$nulls":3},0,{"$nulls":3},0]
["Transport",null,0,{"$nulls":3},0,{"$nulls":3},0]
["Medical & Health",null,0,{"$nulls":3},0,{"$nulls":3},0]
["Education (excluding Private School Fees)",null,0,{"$nulls":3},0,{"$nulls":3},0]
["Education - Private School Fees *",null,0,{"$nulls":3},0,{"$nulls":3},0]
["Childcare",null,0,{"$nulls":3},0,{"$nulls":3},0]
["Insurance (excluding Private Health, Life and IP)",null,0,{"$nulls":3},0,{"$nulls":3},0]
["Private Health, Life and IP Insurance *",null,0,{"$nulls":3},0,{"$nulls":3},0]
["Telephone, Internet, Pay TV & Media Streaming",null,0,{"$nulls":3},0,{"$nulls":3},0]
["Recreation & Entertainment",null,0,{"$nulls":3},0,{"$nulls":3},0]
["Memberships (gym, sporting clubs etc)",null,0,{"$nulls":3},0,{"$nulls":3},0]
["Non-Compulsory Superannuation *",null,0,{"$nulls":3},0,{"$nulls":3},0]
["Maintenance *",null,0,{"$nulls":3},0,{"$nulls":3},0]
["Other Living Expenses",null,0,{"$nulls":3},0,{"$nulls":3},0]
[]
["Total Monthly Living Expenses Declared (HEM & non-HEM)",null,{"$f":"SUM(C45:C61)","v":0},{"$nulls":3},{"$f":"SUM(G45:G61)","v":0},{"$nulls":3},{"$f":"SUM(K45:K61)","v":0}]
[null,null,{"$f":"C124","v":""},{"$nulls":3},{"$f":"E124","v":""},{"$nulls":3},{"$f":"G124","v":""}]
["HEM Living Expense",null,{"$f":"C38","v":""},{"$nulls":3},{"$f":"E38","v":""},{"$nulls":3},{"$f":"G38","v":""}]
["Monthly Living Expenses Used",null,{"$f":"MAX(C38:C39)+C46+C52+C55+C60+C59","v":0},{"$nulls":3},{"$f":"MAX(E38:E39)+G46+G52+G55+G60+G59","v":0},{"$nulls":3},{"$f":"MAX(G38:G39)+K46+K52+K55+K60+K59","v":0}]
[]
["Other Commitments"]
[]
[null,null,"Debt / Limit",null,"Monthly Repayment",null,"Interest Rate"]
["Owner Occupied Property 1",null,0,{"$f":"IFERROR(RATE(360,SUM(E71),SUM(C71)*-1,0,0,0.1)*12,0)","v":0},0,{"$f":"IF((D71+List!$B$13)>=List!$B$16,(PMT((D71+List!$B$13)/12,360,SUM(C71),0,0)*-1)-SUM(E71),(PMT((List!$B$16)/12,360,SUM(C71),0,0)*-1)-SUM(E71))","v":0},0]
["Owner Occupied Property 2",null,0,0,0,{"$f":"IF((D72+List!$B$13)>=List!$B$16,(PMT((D72+List!$B$13)/12,360,SUM(C72),0,0)*-1)-SUM(E72),(PMT((List!$B$16)/12,360,SUM(C72),0,0)*-1)-SUM(E72))","v":0},0]
["Investment Property 1",null,0,0,0,{"$f":"IF((D73+List!$B$13)>=List!$B$16,(PMT((D73+List!$B$13)/12,360,SUM(C73),0,0)*-1)-SUM(E73),(PMT((List!$B$16)/12,360,SUM(C73),0,0)*-1)-SUM(E73))","v":0},0]
["Investment Property 2",null,0,0,0,{"$f":"IF((D74+List!$B$13)>=List!$B$16,(PMT((D74+List!$B$13)/12,360,SUM(C74),0,0)*-1)-SUM(E74),(PMT((List!$B$16)/12,360,SUM(C74),0,0)*-1)-SUM(E74))","v":0},0]
["Investment Property 3",null,0,0,0,{"$f":"IF((D75+List!$B$13)>=List!$B$16,(PMT((D75+List!$B$13)/12,360,SUM(C75),0,0)*-1)-SUM(E75),(PMT((List!$B$16)/12,360,SUM(C75),0,0)*-1)-SUM(E75))","v":0},0]
["Investment Property 4",null,0,0,0,{"$f":"IF((D76+List!$B$13)>=List!$B$16,(PMT((D76+List!$B$13)/12,360,SUM(C76),0,0)*-1)-SUM(E76),(PMT((List!$B$16)/12,360,SUM(C76),0,0)*-1)-SUM(E76))","v":0},0]
["Other Liabilities 1",null,0,null,0,null,0]
["Other Liabilities 2",null,0,null,0,null,0]
["Other Liabilities (Fixed)",null,0,null,0,null,0]
["Credit Card 1",null,0,null,{"$f":"C80*HEM!$C$1","v":0}]
["Credit Card 2",null,0,null,{"$f":"C81*HEM!$C$1","v":0}]
[{"$nulls":4},{"$f":"SUMIF(F71:F76,\">0\",F71:F76)","v":0}]
["Rent/Board",{"$nulls":3},0]
[]
["TOTAL EXISTING COMMITMENTS",{"$nulls":3},{"$f":"SUM(E71:E81)+E83","v":0}]
["TOTAL ASSESSED EXISTING COMMITMENTS",{"$nulls":3},{"$f":"E82+E85","v":0}]
[]
["Loan Details"]
[null,null,"App#1",null,"App#2",null,"App#3",null,"App#4",null,"App#5"]
["New Loan Amount",null,0,null,0,null,0,null,0,null,0]
["Repayment Type",null,"Amortising",null,"Amortising",null,"Amortising",null,"Amortising",null,"Amortising"]
["Loan Term (Years)",null,30,null,30,null,30,null,30,null,30]
["Interest Only Term (Years)",null,0,null,0,null,0,null,0,null,0]
[]
["Interest Rate",null,{"v":0.05,"d":"5.00%"},null,{"v":0.05,"d":"5.00%"},null,{"v":0.05,"d":"5.00%"},null,{"v":0.05,"d":"5.00%"},null,{"v":0.05,"d":"5.00%"}]
["Sensitivity",null,{"$f":"MAX(List!J15:J16)-C95","v":{"v":0.020000000000000004,"d":"2.00%"}},null,{"$f":"MAX(List!K15:K16)-E95","v":{"v":0.020000000000000004,"d":"2.00%"}},null,{"$f":"MAX(List!L15:L16)-G95","v":{"v":0.020000000000000004,"d":"2.00%"}},null,{"$f":"MAX(List!M15:M16)-I95","v":{"v":0.020000000000000004,"d":"2.00%"}},null,{"$f":"MAX(List!N15:N16)-K95","v":{"v":0.020000000000000004,"d":"2.00%"}}]
["Assessment Rate",null,{"$f":"C95+C96","v":{"v":0.07,"d":"7.00%"}},null,{"$f":"E95+E96","v":{"v":0.07,"d":"7.00%"}},null,{"$f":"G95+G96","v":{"v":0.07,"d":"7.00%"}},null,{"$f":"I95+I96","v":{"v":0.07,"d":"7.00%"}},null,{"$f":"K95+K96","v":{"v":0.07,"d":"7.00%"}}]
[]
["Monthly Loan Repayment",null,{"$f":"IF(C91=\"Amortising\",-PMT(C95/12,(C92-C93)*12,C90,0,0),C90*C95/12)","v":0},null,{"$f":"IF(E91=\"Amortising\",-PMT(E95/12,(E92-E93)*12,E90,0,0),E90*E95/12)","v":0},null,{"$f":"IF(G91=\"Amortising\",-PMT(G95/12,(G92-G93)*12,G90,0,0),G90*G95/12)","v":0},null,{"$f":"IF(I91=\"Amortising\",-PMT(I95/12,(I92-I93)*12,I90,0,0),I90*I95/12)","v":0},null,{"$f":"IF(K91=\"Amortising\",-PMT(K95/12,(K92-K93)*12,K90,0,0),K90*K95/12)","v":0}]
["Monthly Assessed Repayment",null,{"$f":"IF(C91=\"Amortising\",-PMT(C97/12,(C92-C93)*12,C90,0,0),C90*C97/12)","v":0},null,{"$f":"IF(E91=\"Amortising\",-PMT(E97/12,(E92-E93)*12,E90,0,0),E90*E97/12)","v":0},null,{"$f":"IF(G91=\"Amortising\",-PMT(G97/12,(G92-G93)*12,G90,0,0),G90*G97/12)","v":0},null,{"$f":"IF(I91=\"Amortising\",-PMT(I97/12,(I92-I93)*12,I90,0,0),I90*I97/12)","v":0},null,{"$f":"IF(K91=\"Amortising\",-PMT(K97/12,(K92-K93)*12,K90,0,0),K90*K97/12)","v":0}]
[]
["Results"]
[]
[null,null,"Monthly"]
["Total Income",null,{"$f":"SUM(C28:L28)","v":0},null,"NSI:",null,{"$f":"C105-C106-C107-C108","v":0},null,{"$f":"IF(G105>0,IF(G107>1.24999,\"PASS\",\"FAIL\"),\"FAIL\")","v":"FAIL"}]
["Living Expenses",null,{"$f":"C66+G66+K66","v":0},null,"Debt Service Ratio:",null,{"$f":"C105/SUM(C106:C108)","v":{"$error":"#DIV/0!"}}]
["Existing Commitments",null,{"$f":"E86","v":0},null,"ICR:",null,{"$f":"IFERROR(((C105-C106)*12)/((C71*G71)+(C72*G72)+(C73*G73)+(C74*G74)+(C75*G75)+(C76*G76)+(C77*G77)+(C78*G78)+(C79*G79)+(C90*C95)+(E90*E95)+(G90*G95)+(I90*I95)+(K90*K95)),\"\")","v":""},null,{"$f":"K130","v":""}]
["Proposed Repayments",null,{"$f":"C100+E100+G100+I100+K100","v":0}]
[]
[]
[{"$f":"Menu!A21","v":"The information contained in this calculator is provided by LoanOne Pty Ltd ACN  161 283 147, Australian Credit License 501182 for illustrative purposes only and should not be regarded as a prediction, or as personal advice. Calculations are not forecasts or projections but is a tool that may assist you to make your own projections. The calculator is not intended to be a substitute for professional advice. The information in this calculator does not constitute an offer to lend, or imply the product is suitable for clients. Before acting on this general information, your client must consider its appropriateness having regard to their own objectives, financial situation and need and also seek independent financial, legal and taxation advice. No guarantee, warranty, or representation is given or implied as to the reliability or accuracy of the information use to compile each index or each calculation. LoanOne specifically disclaims any liability for any direct, indirect, incidental, consequential, or special damages or for any loss arising out of or in any way connected with the access to, reliance on, or use of this calculator."}]
[]
[]
["Count",null,{"$f":"COUNTIF($C$11:$M$11,C11)","v":0},null,{"$f":"COUNTIF($C$11:$M$11,E11)","v":0},null,{"$f":"COUNTIF($C$11:$M$11,G11)","v":0},null,{"$f":"COUNTIF($C$11:$M$11,I11)","v":0},null,{"$f":"COUNTIF($C$11:$M$11,K11)","v":0}]
[]
["Individual (Single)",null,{"$f":"IF(C10=\"Individual (Single)\",IF(C114=1,\"\",IF(C114>1,\"Only 1 Household per Single Applicant\",\"Applicant needs to be assigned a Household\")))","v":false},null,{"$f":"IF(E10=\"Individual (Single)\",IF(E114=1,\"\",IF(E114>1,\"Only 1 Household per Single Applicant\",\"Applicant needs to be assigned a Household\")))","v":false},null,{"$f":"IF(G10=\"Individual (Single)\",IF(G114=1,\"\",IF(G114>1,\"Only 1 Household per Single Applicant\",\"Applicant needs to be assigned a Household\")))","v":false},null,{"$f":"IF(I10=\"Individual (Single)\",IF(I114=1,\"\",IF(I114>1,\"Only 1 Household per Single Applicant\",\"Applicant needs to be assigned a Household\")))","v":false},null,{"$f":"IF(K10=\"Individual (Single)\",IF(K114=1,\"\",IF(K114>1,\"Only 1 Household per Single Applicant\",\"Applicant needs to be assigned a Household\")))","v":false}]
["Individual (Couple)",null,{"$f":"IF(C10=\"Individual (Couple)\",IF(C114=1,\"\",IF(C114=2,\"\",IF(C114>2,\"Only 1 Household per Couple Applicant\",IF(C114<1,\"Applicant needs to be assigned a Household\",)))))","v":false},null,{"$f":"IF(E10=\"Individual (Couple)\",IF(E114=1,\"\",IF(E114=2,\"\",IF(E114>2,\"Only 1 Household per Couple Applicant\",IF(E114<1,\"Applicant needs to be assigned a Household\",)))))","v":false},null,{"$f":"IF(G10=\"Individual (Couple)\",IF(G114=1,\"\",IF(G114=2,\"\",IF(G114>2,\"Only 1 Household per Couple Applicant\",IF(G114<1,\"Applicant needs to be assigned a Household\",)))))","v":false},null,{"$f":"IF(I10=\"Individual (Couple)\",IF(I114=1,\"\",IF(I114=2,\"\",IF(I114>2,\"Only 1 Household per Couple Applicant\",IF(I114<1,\"Applicant needs to be assigned a Household\",)))))","v":false},null,{"$f":"IF(K10=\"Individual (Couple)\",IF(K114=1,\"\",IF(K114=2,\"\",IF(K114>2,\"Only 1 Household per Couple Applicant\",IF(K114<1,\"Applicant needs to be assigned a Household\",)))))","v":false}]
["n/a",null,{"$f":"IF(C10=\"n/a\",IF(C114>0,\"Household should only be applied where an applicant exists\",\"\"))","v":""},null,{"$f":"IF(E10=\"n/a\",IF(E114>0,\"Household should only be applied where an applicant exists\",\"\"))","v":""},null,{"$f":"IF(G10=\"n/a\",IF(G114>0,\"Household should only be applied where an applicant exists\",\"\"))","v":""},null,{"$f":"IF(I10=\"n/a\",IF(I114>0,\"Household should only be applied where an applicant exists\",\"\"))","v":""},null,{"$f":"IF(K10=\"n/a\",IF(K114>0,\"Household should only be applied where an applicant exists\",\"\"))","v":""}]
["Company",null,{"$f":"IF(C10=\"Company\",IF(C114>0,\"Household should not be applied to a Company Applicant\",\"\"))","v":false},null,{"$f":"IF(E10=\"Company\",IF(E114>0,\"Household should not be applied to a Company Applicant\",\"\"))","v":false},null,{"$f":"IF(G10=\"Company\",IF(G114>0,\"Household should not be applied to a Company Applicant\",\"\"))","v":false},null,{"$f":"IF(I10=\"Company\",IF(I114>0,\"Household should not be applied to a Company Applicant\",\"\"))","v":false},null,{"$f":"IF(K10=\"Company\",IF(K114>0,\"Household should not be applied to a Company Applicant\",\"\"))","v":false}]
["Error Message",null,{"$f":"IFERROR(VLOOKUP(C10,$A$116:$M$119,3,FALSE),\"\")","v":""},null,{"$f":"IFERROR(VLOOKUP(E10,$A$116:$M$119,5,FALSE),\"\")","v":""},null,{"$f":"IFERROR(VLOOKUP(G10,$A$116:$M$119,7,FALSE),\"\")","v":""},null,{"$f":"IFERROR(VLOOKUP(I10,$A$116:$M$119,9,FALSE),\"\")","v":""},null,{"$f":"IFERROR(VLOOKUP(K10,$A$116:$M$119,11,FALSE),\"\")","v":""}]
[]
["Household",null,1,null,2,null,3]
["Household Count",null,{"$f":"COUNTIF($C$11:$M$11,C122)","v":0},null,{"$f":"COUNTIF($C$11:$M$11,E122)","v":0},null,{"$f":"COUNTIF($C$11:$M$11,G122)","v":0}]
["Expense Error",null,{"$f":"IF(C123=0,IF(C39>0,\"Household 1 has not been assigned to an applicant\",\"\"),IF(C39<C38,\"Monthly living expenses are less than benchmark, detailed explanation required\",\"\"))","v":""},null,{"$f":"IF(E123=0,IF(E39>0,\"Household 1 has not been assigned to an applicant\",\"\"),IF(E39<E38,\"Monthly living expenses are less than benchmark, detailed explanation required\",\"\"))","v":""},null,{"$f":"IF(G123=0,IF(G39>0,\"Household 1 has not been assigned to an applicant\",\"\"),IF(G39<G38,\"Monthly living expenses are less than benchmark, detailed explanation required\",\"\"))","v":""}]
[]
[]
["Bank Statements",null,{"$f":"B38+D38+F38","v":0}]
["Bank Statements",null,{"$f":"C105-C127-C107-C108","v":0},null,{"$f":"IFERROR(AND(G107<1.1,G107>1,E40<1.1),\"\")","v":false},null,{"$f":"IFERROR(AND(G107<1.1,G107>1,G40<1.1),\"\")","v":false}]
[]
["Error Message",null,{"$f":"IF(C128<0,\"Where borrower/s are individuals, 3 months banks statements / transaction statements required to support loan application\",\"\")","v":""},{"$nulls":7},{"$f":"C130","v":""}]

{"sheet":"SMSF","index":7,"n_rows":62,"n_cols":13,"rows_kept":62,"hidden":true,"merged":[[0,1,1,6],[2,0,2,4],[2,6,2,12],[4,2,4,6],[7,0,7,13],[30,0,30,13],[31,0,31,2],[36,0,36,13],[41,0,41,2],[42,0,42,2],[44,0,44,13],[45,12,45,13],[46,12,46,13],[48,12,48,13],[53,0,53,13],[58,6,59,6],[61,0,62,13]]}
[]
[]
[" SMSF Serviceability Calculator",{"$nulls":5},{"$f":"Menu!A6","v":"Version 1.18 (1 September 2023)"}]
[]
["Application Name:"]
["Application #:"]
[]
["Income Details"]
[]
["Applicant Details:",null,"Member 1",null,"Member 2",null,"Member 3",null,"Member 4",null,"Member 5",null,"Member 6"]
[]
["Gross Annual Income",null,0,null,0,null,0,null,0,null,0,null,0]
["Compulsory Superannuation Contributions",null,0,null,0,null,0,null,0,null,0,null,0]
["Superannuation Contributions (%)",null,{"$f":"IFERROR(C13/C12,\"\")","v":""},null,{"$f":"IFERROR(E13/E12,\"\")","v":""},null,{"$f":"IFERROR(G13/G12,\"\")","v":""},null,{"$f":"IFERROR(I13/I12,\"\")","v":""},null,{"$f":"IFERROR(K13/K12,\"\")","v":""},null,{"$f":"IFERROR(M13/M12,\"\")","v":""}]
["Current Salary Sacrifice Contributions",null,0,null,0,null,0,null,0,null,0,null,0]
["Current Non-Concessional Contibutions",null,0,null,0,null,0,null,0,null,0,null,0]
["Future Salary Sacrifice Contributions",null,{"$f":"'Residential SMSF'!C113","v":0},null,{"$f":"'Residential SMSF'!E113","v":0},null,{"$f":"'Residential SMSF'!G113","v":0},null,{"$f":"'Residential SMSF'!I113","v":0},null,{"$f":"'Residential SMSF'!K113","v":0},null,{"$f":"'Residential SMSF'!M113","v":0}]
[null,null,{"$f":"'SMSF Tax Tables'!G21","v":""},null,{"$f":"'SMSF Tax Tables'!I21","v":""},null,{"$f":"'SMSF Tax Tables'!K21","v":""},null,{"$f":"'SMSF Tax Tables'!M21","v":""},null,{"$f":"'SMSF Tax Tables'!O21","v":""},null,{"$f":"'SMSF Tax Tables'!Q21","v":""}]
[]
["SMSF Details:"]
[]
["Annual Gross Rental Income (Security)",null,0,null,"Interest Expense",null,{"$f":"C47*G47","v":0}]
["Annual Gross Rental Income (Other)",null,0,null,"Interest Expense",null,{"$f":"(C39*G39)+(C40*G40)","v":0}]
[]
["Other SMSF Assets",null,0,null,"Investment Returns",null,{"$f":"(C25*'Tax Tables'!$D$3)","v":0}]
[]
["Total Income",null,{"$f":"SUM(C13:M13)+SUM(C15:M17)+(C22*'SMSF Tax Tables'!D1)+(C23*'SMSF Tax Tables'!D1)+SMSF!G25","v":0}]
["Less Tax",null,{"$f":"'SMSF Tax Tables'!S36","v":0}]
["Net Income",null,{"$f":"C27-C28","v":0}]
[]
["SMSF Ongoing Expenses (Annual)"]
[]
["Total Ongoing SMSF Expenses Declared",null,0]
["Minimum SMSF Ongoing Expenses",null,{"v":2500,"d":"$2,500"}]
["SMSF Ongoing Expenses Used",null,{"$f":"MAX(C33:C34)","v":{"v":2500,"d":"$2,500"}}]
[]
["Other Commitments"]
[null,null,"Debt / Limit",null,"Monthly Repayment",null,"Interest Rate"]
["Investment Property 1",null,0,{"$f":"IFERROR(RATE(360,SUM(E39),SUM(C39)*-1,0,0,0.1)*12,0)","v":0},0,{"$f":"IF((D39+List!$B$13)>=List!$B$16,(PMT((D39+List!$B$13)/12,360,SUM(C39),0,0)*-1)-SUM(E39),(PMT((List!$B$16)/12,360,SUM(C39),0,0)*-1)-SUM(E39))","v":0},0]
["Investment Property 2",null,0,{"$f":"IFERROR(RATE(360,SUM(E40),SUM(C40)*-1,0,0,0.1)*12,0)","v":0},0,{"$f":"IF((D40+List!$B$13)>=List!$B$16,(PMT((D40+List!$B$13)/12,360,SUM(C40),0,0)*-1)-SUM(E40),(PMT((List!$B$16)/12,360,SUM(C40),0,0)*-1)-SUM(E40))","v":0},0]
[null,null,{"$f":"IFERROR(RATE(360,SUM(E39:E40),SUM(C39:C40)*-1,0,0,0.1)*12,0)","v":0},null,{"$f":"SUM(F39:F40)","v":0}]
["TOTAL EXISTING COMMITMENTS",{"$nulls":3},{"$f":"SUM(E39:E40)","v":0}]
["TOTAL ASSESSED EXISTING COMMITMENTS",{"$nulls":3},{"$f":"E42+E41","v":0}]
[]
["Loan Details"]
[]
["New Loan Amount",null,0,null,"Interest Rate",5,{"v":0.05,"d":"5.00%"}]
["Repayment Type",null,"Amortising",null,"Sensitivity",null,{"$f":"MAX(List!O15:O16)-G47","v":{"v":0.020000000000000004,"d":"2.00%"}}]
["Loan Term",null,30,null,"Assessment Rate",5,{"$f":"G47+G48","v":{"v":0.07,"d":"7.00%"}}]
["Interest Only Term",null,0]
[{"$nulls":4},"Monthly Loan Repayment",null,{"$f":"IFERROR(IF(C48=\"Amortising\",-PMT(G47/12,(C49-C50)*12,C47,0,0),C47*G47/12),\"\")","v":0}]
[{"$nulls":4},"Monthly Assessed Repayment",null,{"$f":"IFERROR(IF(C48=\"Amortising\",-PMT(G49/12,(C49-C50)*12,C47,0,0),C47*G49/12),\"\")","v":0}]
[]
["Results"]
[]
[null,null,"Monthly"]
["Net Income",null,{"$f":"C29/12","v":0},null,"NSI:",null,{"$f":"IFERROR(C57-C58-C59-C60,\"\")","v":{"v":-208.33333333333334,"d":"-$208"}}]
["SMSF Ongoing Expenses",null,{"$f":"C35/12","v":{"v":208.33333333333334,"d":"$208"}},null,"ICR:",null,{"$f":"IFERROR((C29-C35)/(G22+G23),\"\")","v":""}]
["Existing Commitments",null,{"$f":"E43","v":0},{"$nulls":3},{"$f":"IF(G57>0,IF(G58>1.24999999,\"PASS\",\"FAIL\"),\"FAIL\")","v":"FAIL"}]
["Proposed Repayments",null,{"$f":"G52","v":0}]
[]
[{"$f":"Menu!A21","v":"The information contained in this calculator is provided by LoanOne Pty Ltd ACN  161 283 147, Australian Credit License 501182 for illustrative purposes only and should not be regarded as a prediction, or as personal advice. Calculations are not forecasts or projections but is a tool that may assist you to make your own projections. The calculator is not intended to be a substitute for professional advice. The information in this calculator does not constitute an offer to lend, or imply the product is suitable for clients. Before acting on this general information, your client must consider its appropriateness having regard to their own objectives, financial situation and need and also seek independent financial, legal and taxation advice. No guarantee, warranty, or representation is given or implied as to the reliability or accuracy of the information use to compile each index or each calculation. LoanOne specifically disclaims any liability for any direct, indirect, incidental, consequential, or special damages or for any loss arising out of or in any way connected with the access to, reliance on, or use of this calculator."}]

{"sheet":"Residential SMSF","index":8,"n_rows":137,"n_cols":14,"rows_kept":137,"hidden":true,"merged":[[0,2,1,10],[2,0,2,8],[2,10,2,12],[4,2,4,6],[6,0,6,13],[28,0,28,13],[40,0,40,2],[44,0,44,2],[45,0,45,2],[46,0,46,2],[47,0,47,2],[48,0,48,2],[49,0,49,2],[50,0,50,2],[51,0,51,2],[52,0,52,2],[53,0,53,2],[54,0,54,2],[55,0,55,2],[56,0,56,2],[57,0,57,2],[58,0,58,2],[59,0,59,2],[60,0,60,2],[62,0,62,2],[65,0,65,2],[66,0,66,2],[69,2,69,4],[69,6,69,8],[69,10,69,12],[85,0,85,2],[86,0,86,2],[105,4,106,4],[105,8,106,8],[105,12,106,12],[111,0,112,0],[115,2,115,12],[118,0,119,13]]}
[]
[]
["SMSF Residential Serviceability Calculator",{"$nulls":9},{"$f":"Menu!A6","v":"Version 1.18 (1 September 2023)"}]
[]
["Application Name:",{"$nulls":7},"Application #:"]
[]
["Income Details"]
[]
["Applicant Details:",null,"Member 1",null,"Member 2",null,"Member 3",null,"Member 4",null,"Member 5",null,"Member 6"]
["Status",null,"n/a",null,"n/a",null,"n/a",null,"n/a",null,"n/a",null,"n/a"]
["Household"]
[null,null,{"$f":"C129","v":""},null,{"$f":"E129","v":""},null,{"$f":"G129","v":""},null,{"$f":"I129","v":""},null,{"$f":"K129","v":""},null,{"$f":"M129","v":""}]
["Individual"]
["HECS/HELP Debt",null,"No",null,"No",null,"No",null,"No",null,"No",null,"No"]
["Gross Annual Income",null,0,null,0,null,0,null,0,null,0,null,0]
["Annual Non-Taxable Income",null,0,null,0,null,0,null,0,null,0,null,0]
[]
["Annual Gross Rental Income",null,0,null,0,null,0,null,0,null,0,null,0]
["Annual Investment Property Interest (Negative Gearing)",null,0,null,0,null,0,null,0,null,0,null,0]
["Annual Investment property utilities, rates & costs",null,0,null,0,null,0,null,0,null,0,null,0]
["Company"]
["NPBT",null,0,null,0,null,0,null,0,null,0,null,0]
["Addbacks",null,0,null,0,null,0,null,0,null,0,null,0]
["Annual Gross Rental Income (not included in NPBT)",null,0,null,0,null,0,null,0,null,0,null,0]
[null,null,{"$f":"((C15+C16)/12)+((C22+C23+(C24))/12)+(C18/12)","v":0},null,{"$f":"((E15+E16)/12)+((E22+E23+(E24))/12)+(E18/12)","v":0},null,{"$f":"((G15+G16)/12)+((G22+G23+(G24))/12)+(G18/12)","v":0},null,{"$f":"((I15+I16)/12)+((I22+I23+(I24))/12)+(I18/12)","v":0},null,{"$f":"((K15+K16)/12)+((K22+K23+(K24))/12)+(K18/12)","v":0},null,{"$f":"((M15+M16)/12)+((M22+M23+(M24))/12)+(M18/12)","v":0}]
["Total Income (Monthly)",null,{"$f":"((C15+C16)/12)+((C22+C23+(C24*'Resi SMSF Tax Tables'!$D$1))/12)+(C18/12*'Resi SMSF Tax Tables'!$D$1)","v":0},null,{"$f":"((E15+E16)/12)+((E22+E23+(E24*'Resi SMSF Tax Tables'!$D$1))/12)+(E18/12*'Resi SMSF Tax Tables'!$D$1)","v":0},null,{"$f":"((G15+G16)/12)+((G22+G23+(G24*'Resi SMSF Tax Tables'!$D$1))/12)+(G18/12*'Resi SMSF Tax Tables'!$D$1)","v":0},null,{"$f":"((I15+I16)/12)+((I22+I23+(I24*'Resi SMSF Tax Tables'!$D$1))/12)+(I18/12*'Resi SMSF Tax Tables'!$D$1)","v":0},null,{"$f":"((K15+K16)/12)+((K22+K23+(K24*'Resi SMSF Tax Tables'!$D$1))/12)+(K18/12*'Resi SMSF Tax Tables'!$D$1)","v":0},null,{"$f":"((M15+M16)/12)+((M22+M23+(M24*'Resi SMSF Tax Tables'!$D$1))/12)+(M18/12*'Resi SMSF Tax Tables'!$D$1)","v":0}]
["Net Income (Monthly)",null,{"$f":"IF(C10=\"Company\",C26-('Resi SMSF Tax Tables'!H$42/12)-((C20)/12),IF(C14=\"No\",C26-('Resi SMSF Tax Tables'!H$42/12)-((C22+(C24*'Resi SMSF Tax Tables'!$D$1)+C23)*'Resi SMSF Tax Tables'!$D$2/12)-((C20)/12),C26-('Resi SMSF Tax Tables'!H$65/12)-((C22+(C24*'Resi SMSF Tax Tables'!$D$1)+C23)*'Resi SMSF Tax Tables'!$D$2/12)-((C20)/12)))","v":0},null,{"$f":"IF(E10=\"Company\",E26-('Resi SMSF Tax Tables'!J$42/12)-((E20)/12),IF(E14=\"No\",E26-('Resi SMSF Tax Tables'!J$42/12)-((E22+(E24*'Resi SMSF Tax Tables'!$D$1)+E23)*'Resi SMSF Tax Tables'!$D$2/12)-((E20)/12),E26-('Resi SMSF Tax Tables'!J$65/12)-((E22+(E24*'Resi SMSF Tax Tables'!$D$1)+E23)*'Resi SMSF Tax Tables'!$D$2/12)-((E20)/12)))","v":0},null,{"$f":"IF(G10=\"Company\",G26-('Resi SMSF Tax Tables'!L$42/12)-((G20)/12),IF(G14=\"No\",G26-('Resi SMSF Tax Tables'!L$42/12)-((G22+(G24*'Resi SMSF Tax Tables'!$D$1)+G23)*'Resi SMSF Tax Tables'!$D$2/12)-((G20)/12),G26-('Resi SMSF Tax Tables'!L$65/12)-((G22+(G24*'Resi SMSF Tax Tables'!$D$1)+G23)*'Resi SMSF Tax Tables'!$D$2/12)-((G20)/12)))","v":0},null,{"$f":"IF(I10=\"Company\",I26-('Resi SMSF Tax Tables'!N$42/12)-((I20)/12),IF(I14=\"No\",I26-('Resi SMSF Tax Tables'!N$42/12)-((I22+(I24*'Resi SMSF Tax Tables'!$D$1)+I23)*'Resi SMSF Tax Tables'!$D$2/12)-((I20)/12),I26-('Resi SMSF Tax Tables'!N$65/12)-((I22+(I24*'Resi SMSF Tax Tables'!$D$1)+I23)*'Resi SMSF Tax Tables'!$D$2/12)-((I20)/12)))","v":0},null,{"$f":"IF(K10=\"Company\",K26-('Resi SMSF Tax Tables'!P$42/12)-((K20)/12),IF(K14=\"No\",K26-('Resi SMSF Tax Tables'!P$42/12)-((K22+(K24*'Resi SMSF Tax Tables'!$D$1)+K23)*'Resi SMSF Tax Tables'!$D$2/12)-((K20)/12),K26-('Resi SMSF Tax Tables'!P$65/12)-((K22+(K24*'Resi SMSF Tax Tables'!$D$1)+K23)*'Resi SMSF Tax Tables'!$D$2/12)-((K20)/12)))","v":0},null,{"$f":"IF(M10=\"Company\",M26-('Resi SMSF Tax Tables'!R$42/12)-((M20)/12),IF(M14=\"No\",M26-('Resi SMSF Tax Tables'!R$42/12)-((M22+(M24*'Resi SMSF Tax Tables'!$D$1)+M23)*'Resi SMSF Tax Tables'!$D$2/12)-((M20)/12),M26-('Resi SMSF Tax Tables'!R$65/12)-((M22+(M24*'Resi SMSF Tax Tables'!$D$1)+M23)*'Resi SMSF Tax Tables'!$D$2/12)-((M20)/12)))","v":0}]
[]
["Living Expenses (Per Month) - All living expenses must be completed. Where an amount is $0, further explanation is required"]
["Household",{"$nulls":3},1,{"$nulls":3},2,{"$nulls":3},3]
["Household Status",{"$nulls":3},{"$f":"IF(E30=$C$11,$C$10,IF(E30=$E$11,$E$10,IF(E30=$G$11,$G$10,IF(E30=$I$11,$I$10,IF(E30=$K$11,$K$10,IF(E30=$M$11,$M$10,\"\"))))))","v":""},{"$nulls":3},{"$f":"IF(I30=$C$11,$C$10,IF(I30=$E$11,$E$10,IF(I30=$G$11,$G$10,IF(I30=$I$11,$I$10,IF(I30=$K$11,$K$10,IF(I30=$M$11,$M$10,\"\"))))))","v":""},{"$nulls":3},{"$f":"IF(M30=$C$11,$C$10,IF(M30=$E$11,$E$10,IF(M30=$G$11,$G$10,IF(M30=$I$11,$I$10,IF(M30=$K$11,$K$10,IF(M30=$M$11,$M$10,\"\"))))))","v":""}]
["Status ID",{"$nulls":3},{"$f":"IFERROR(VLOOKUP(E31,List!$B$1:$C$5,2,FALSE),\"\")","v":""},{"$nulls":3},{"$f":"IFERROR(VLOOKUP(I31,List!$B$1:$C$5,2,FALSE),\"\")","v":""},{"$nulls":3},{"$f":"IFERROR(VLOOKUP(M31,List!$B$1:$C$5,2,FALSE),\"\")","v":""}]
["Dependents",{"$nulls":3},{"$f":"E43","v":0},{"$nulls":3},{"$f":"I43","v":0},{"$nulls":3},{"$f":"M43","v":0}]
["HEMID",{"$nulls":3},{"$f":"E32&E33","v":"0"},{"$nulls":3},{"$f":"I32&I33","v":"0"},{"$nulls":3},{"$f":"M32&M33","v":"0"}]
["HouseholdIncome",{"$nulls":3},{"$f":"(SUMIF($C$11:$M$11,E30,$C$26:$M$26)*12)-(SUMIF(C11:M11,E30,C19:M19))-(SUMIF(C11:M11,E30,C20:M20))","v":0},{"$nulls":3},{"$f":"(SUMIF($C$11:$M$11,I30,$C$26:$M$26)*12)-(SUMIF(C11:M11,I30,C19:M19))-(SUMIF(C11:M11,I30,C20:M20))","v":0},{"$nulls":3},{"$f":"(SUMIF($C$11:$M$11,M30,$C$26:$M$26)*12)-(SUMIF(C11:M11,M30,C19:M19))-(SUMIF(C11:M11,M30,C20:M20))","v":0}]
["HEM",{"$nulls":3},{"$f":"IFERROR(HLOOKUP(E35,HEM!$B$20:$P$21,2,TRUE)+1,\"\")","v":2},{"$nulls":3},{"$f":"IFERROR(HLOOKUP(I35,HEM!$B$20:$P$21,2,TRUE)+1,\"\")","v":2},{"$nulls":3},{"$f":"IFERROR(HLOOKUP(M35,HEM!$B$20:$P$21,2,TRUE)+1,\"\")","v":2}]
["HEM Amount",{"$nulls":3},{"$f":"IFERROR(VLOOKUP(E34,HEM!$B$22:$P$37,'Residential SMSF'!E36,FALSE)*52/12,\"\")","v":""},{"$nulls":3},{"$f":"IFERROR(VLOOKUP(I34,HEM!$B$22:$P$37,'Residential SMSF'!I36,FALSE)*52/12,\"\")","v":""},{"$nulls":3},{"$f":"IFERROR(VLOOKUP(M34,HEM!$B$22:$P$37,'Residential SMSF'!M36,FALSE)*52/12,\"\")","v":""}]
["Declared living expenses exculding non HEM",{"$nulls":3},{"$f":"E45+E47+E48+E49+E50+E51+E53+E54+E56+E57+E58+E61","v":0},{"$nulls":3},{"$f":"I45+I47+I48+I49+I50+I51+I53+I54+I56+I57+I58+I61","v":0},{"$nulls":3},{"$f":"M45+M47+M48+M49+M50+M51+M53+M54+M56+M57+M58+M61","v":0}]
[{"$nulls":4},{"$f":"IFERROR(E38/E37,\"\")","v":""},{"$nulls":3},{"$f":"IFERROR(I38/I37,\"\")","v":""},{"$nulls":3},{"$f":"IFERROR(M38/M37,\"\")","v":""}]
[{"v":0.15,"d":"15%"},null,{"$f":"IFERROR(((E37)*(1+A40))+E52+E55+E60+E59,0)","v":0},null,{"$f":"IFERROR(E63-E66,0)","v":0},null,{"$f":"IFERROR(((I37)*(1+A40))+I52+I55+I60+I59,0)","v":0},null,{"$f":"IFERROR(I63-I66,0)","v":0},null,{"$f":"IFERROR(((M37)*(1+A40))+M52+M55+M60+M59,0)","v":0},null,{"$f":"IFERROR(M63-M66,0)","v":0}]
[]
[{"$nulls":4},"Household 1",{"$nulls":3},"Household 2",{"$nulls":3},"Household 3"]
[null,null,"Dependents",null,0,{"$nulls":3},0,{"$nulls":3},0]
[]
["Primary Residence property utilities, rates & costs",{"$nulls":3},0,{"$nulls":3},0,{"$nulls":3},0]
["Investment property utilities, rates & costs *",{"$nulls":3},0,{"$nulls":3},0,{"$nulls":3},0]
["Groceries",{"$nulls":3},0,{"$nulls":3},0,{"$nulls":3},0]
["Clothing & Personal Care",{"$nulls":3},0,{"$nulls":3},0,{"$nulls":3},0]
["Transport",{"$nulls":3},0,{"$nulls":3},0,{"$nulls":3},0]
["Medical & Health",{"$nulls":3},0,{"$nulls":3},0,{"$nulls":3},0]
["Education (excluding Private School Fees)",{"$nulls":3},0,{"$nulls":3},0,{"$nulls":3},0]
["Education - Private School Fees *",{"$nulls":3},0,{"$nulls":3},0,{"$nulls":3},0]
["Childcare",{"$nulls":3},0,{"$nulls":3},0,{"$nulls":3},0]
["Insurance (excluding Private Health, Life and IP)",{"$nulls":3},0,{"$nulls":3},0,{"$nulls":3},0]
["Private Health, Life and IP Insurance *",{"$nulls":3},0,{"$nulls":3},0,{"$nulls":3},0]
["Telephone, Internet, Pay TV & Media Streaming",{"$nulls":3},0,{"$nulls":3},0,{"$nulls":3},0]
["Recreation & Entertainment",{"$nulls":3},0,{"$nulls":3},0,{"$nulls":3},0]
["Memberships (gym, sporting clubs etc)",{"$nulls":3},0,{"$nulls":3},0,{"$nulls":3},0]
["Non-Compulsory Superannuation *",{"$nulls":3},0,{"$nulls":3},0,{"$nulls":3},0]
["Maintenance *",{"$nulls":3},0,{"$nulls":3},0,{"$nulls":3},0]
["Other Living Expenses",{"$nulls":3},0,{"$nulls":3},0,{"$nulls":3},0]
[]
["Total Monthly Living Expenses Declared (HEM & non-HEM)",{"$nulls":3},{"$f":"SUM(E45:E61)","v":0},{"$nulls":3},{"$f":"SUM(I45:I61)","v":0},{"$nulls":3},{"$f":"SUM(M45:M61)","v":0}]
[{"$nulls":4},{"$f":"C133","v":""},{"$nulls":3},{"$f":"E133","v":""},{"$nulls":3},{"$f":"G133","v":""}]
[]
["HEM Living Expense",{"$nulls":3},{"$f":"E37","v":""},{"$nulls":3},{"$f":"I37","v":""},{"$nulls":3},{"$f":"M37","v":""}]
["Monthly Living Expenses Used",{"$nulls":3},{"$f":"MAX(E37:E38)+E46+E52+E55+E60+E59","v":0},{"$nulls":3},{"$f":"MAX(I37:I38)+I46+I52+I55+I60+I59","v":0},{"$nulls":3},{"$f":"MAX(M37:M38)+M46+M52+M55+M60+M59","v":0}]
[]
["Other Commitments"]
[null,null,"Household 1 / Company 1",{"$nulls":3},"Household 2 / Company 2",{"$nulls":3},"Household 3 / Company 3"]
[null,null,"Debt / Limit",null,"Repayment",null,"Debt / Limit",null,"Repayment",null,"Debt / Limit",null,"Repayment"]
["Owner Occupied Property 1",null,0,{"$f":"IFERROR(RATE(360,SUM(E72),SUM(C72)*-1,0,0,0.1)*12,0)","v":{"v":0,"d":"0.0%"}},0,{"$f":"IF((D72+List!$B$13)>=List!$B$16,(PMT((D72+List!$B$13)/12,360,SUM('Residential SMSF'!C72),0,0)*-1)-SUM(E72),(PMT((List!$B$16)/12,360,SUM('Residential SMSF'!C72),0,0)*-1)-SUM(E72))","v":0},0,{"$f":"IFERROR(RATE(360,SUM(I72),SUM(G72)*-1,0,0,0.1)*12,0)","v":{"v":0,"d":"0.0%"}},0,{"$f":"IF((H72+List!$B$13)>=List!$B$16,(PMT((H72+List!$B$13)/12,360,SUM('Residential SMSF'!G72),0,0)*-1)-SUM(I72),(PMT((List!$B$16)/12,360,SUM('Residential SMSF'!G72),0,0)*-1)-SUM(I72))","v":0},0,{"$f":"IFERROR(RATE(360,SUM(M72),SUM(K72)*-1,0,0,0.1)*12,0)","v":{"v":0,"d":"0.0%"}},0,{"$f":"IF((L72+List!$B$13)>=List!$B$16,(PMT((L72+List!$B$13)/12,360,SUM('Residential SMSF'!K72),0,0)*-1)-SUM(M72),(PMT((List!$B$16)/12,360,SUM('Residential SMSF'!K72),0,0)*-1)-SUM(M72))","v":0}]
["Owner Occupied Property 2",null,0,{"v":0,"d":"0.0%"},0,{"$f":"IF((D73+List!$B$13)>=List!$B$16,(PMT((D73+List!$B$13)/12,360,SUM('Residential SMSF'!C73),0,0)*-1)-SUM(E73),(PMT((List!$B$16)/12,360,SUM('Residential SMSF'!C73),0,0)*-1)-SUM(E73))","v":0},0,{"v":0,"d":"0.0%"},0,{"$f":"IF((H73+List!$B$13)>=List!$B$16,(PMT((H73+List!$B$13)/12,360,SUM('Residential SMSF'!G73),0,0)*-1)-SUM(I73),(PMT((List!$B$16)/12,360,SUM('Residential SMSF'!G73),0,0)*-1)-SUM(I73))","v":0},0,{"v":0,"d":"0.0%"},0,{"$f":"IF((L73+List!$B$13)>=List!$B$16,(PMT((L73+List!$B$13)/12,360,SUM('Residential SMSF'!K73),0,0)*-1)-SUM(M73),(PMT((List!$B$16)/12,360,SUM('Residential SMSF'!K73),0,0)*-1)-SUM(M73))","v":0}]
["Investment Property 1",null,0,{"v":0,"d":"0.0%"},0,{"$f":"IF((D74+List!$B$13)>=List!$B$16,(PMT((D74+List!$B$13)/12,360,SUM('Residential SMSF'!C74),0,0)*-1)-SUM(E74),(PMT((List!$B$16)/12,360,SUM('Residential SMSF'!C74),0,0)*-1)-SUM(E74))","v":0},0,{"v":0,"d":"0.0%"},0,{"$f":"IF((H74+List!$B$13)>=List!$B$16,(PMT((H74+List!$B$13)/12,360,SUM('Residential SMSF'!G74),0,0)*-1)-SUM(I74),(PMT((List!$B$16)/12,360,SUM('Residential SMSF'!G74),0,0)*-1)-SUM(I74))","v":0},0,{"v":0,"d":"0.0%"},0,{"$f":"IF((L74+List!$B$13)>=List!$B$16,(PMT((L74+List!$B$13)/12,360,SUM('Residential SMSF'!K74),0,0)*-1)-SUM(M74),(PMT((List!$B$16)/12,360,SUM('Residential SMSF'!K74),0,0)*-1)-SUM(M74))","v":0}]
["Investment Property 2",null,0,{"v":0,"d":"0.0%"},0,{"$f":"IF((D75+List!$B$13)>=List!$B$16,(PMT((D75+List!$B$13)/12,360,SUM('Residential SMSF'!C75),0,0)*-1)-SUM(E75),(PMT((List!$B$16)/12,360,SUM('Residential SMSF'!C75),0,0)*-1)-SUM(E75))","v":0},0,{"v":0,"d":"0.0%"},0,{"$f":"IF((H75+List!$B$13)>=List!$B$16,(PMT((H75+List!$B$13)/12,360,SUM('Residential SMSF'!G75),0,0)*-1)-SUM(I75),(PMT((List!$B$16)/12,360,SUM('Residential SMSF'!G75),0,0)*-1)-SUM(I75))","v":0},0,{"v":0,"d":"0.0%"},0,{"$f":"IF((L75+List!$B$13)>=List!$B$16,(PMT((L75+List!$B$13)/12,360,SUM('Residential SMSF'!K75),0,0)*-1)-SUM(M75),(PMT((List!$B$16)/12,360,SUM('Residential SMSF'!K75),0,0)*-1)-SUM(M75))","v":0}]
["Investment Property 3",null,0,{"v":0,"d":"0.0%"},0,{"$f":"IF((D76+List!$B$13)>=List!$B$16,(PMT((D76+List!$B$13)/12,360,SUM('Residential SMSF'!C76),0,0)*-1)-SUM(E76),(PMT((List!$B$16)/12,360,SUM('Residential SMSF'!C76),0,0)*-1)-SUM(E76))","v":0},0,{"v":0,"d":"0.0%"},0,{"$f":"IF((H76+List!$B$13)>=List!$B$16,(PMT((H76+List!$B$13)/12,360,SUM('Residential SMSF'!G76),0,0)*-1)-SUM(I76),(PMT((List!$B$16)/12,360,SUM('Residential SMSF'!G76),0,0)*-1)-SUM(I76))","v":0},0,{"v":0,"d":"0.0%"},0,{"$f":"IF((L76+List!$B$13)>=List!$B$16,(PMT((L76+List!$B$13)/12,360,SUM('Residential SMSF'!K76),0,0)*-1)-SUM(M76),(PMT((List!$B$16)/12,360,SUM('Residential SMSF'!K76),0,0)*-1)-SUM(M76))","v":0}]
["Investment Property 4",null,0,{"v":0,"d":"0.0%"},0,{"$f":"IF((D77+List!$B$13)>=List!$B$16,(PMT((D77+List!$B$13)/12,360,SUM('Residential SMSF'!C77),0,0)*-1)-SUM(E77),(PMT((List!$B$16)/12,360,SUM('Residential SMSF'!C77),0,0)*-1)-SUM(E77))","v":0},0,{"v":0,"d":"0.0%"},0,{"$f":"IF((H77+List!$B$13)>=List!$B$16,(PMT((H77+List!$B$13)/12,360,SUM('Residential SMSF'!G77),0,0)*-1)-SUM(I77),(PMT((List!$B$16)/12,360,SUM('Residential SMSF'!G77),0,0)*-1)-SUM(I77))","v":0},0,{"v":0,"d":"0.0%"},0,{"$f":"IF((L77+List!$B$13)>=List!$B$16,(PMT((L77+List!$B$13)/12,360,SUM('Residential SMSF'!K77),0,0)*-1)-SUM(M77),(PMT((List!$B$16)/12,360,SUM('Residential SMSF'!K77),0,0)*-1)-SUM(M77))","v":0}]
["Other Liabilities 1",null,0,null,0,null,0,null,0,null,0,null,0]
["Other Liabilities 2",null,0,null,0,null,0,null,0,null,0,null,0]
["Other Liabilities (Fixed)",null,0,null,0,null,0,null,0,null,0,null,0]
["Credit Card 1",null,0,null,{"$f":"C81*HEM!$C$1","v":0},null,0,null,{"$f":"G81*HEM!$C$1","v":0},null,0,null,{"$f":"K81*HEM!$C$1","v":0}]
["Credit Card 2",null,0,null,{"$f":"C82*HEM!$C$1","v":0},null,0,null,{"$f":"G82*HEM!$C$1","v":0},null,0,null,{"$f":"K82*HEM!$C$1","v":0}]
[{"$nulls":4},{"$f":"SUMIF(F72:F77,\">0\",F72:F77)","v":0},{"$nulls":3},{"$f":"SUMIF(J72:J77,\">0\",J72:J77)","v":0},{"$nulls":3},{"$f":"SUMIF(N72:N77,\">0\",N72:N77)","v":0}]
["Rent/Board",{"$nulls":3},0,{"$nulls":3},0,{"$nulls":3},0]
[]
["TOTAL EXISTING COMMITMENTS",{"$nulls":3},{"$f":"SUM(E72:E82)+E84","v":0},{"$nulls":3},{"$f":"SUM(I72:I82)+I84","v":0},{"$nulls":3},{"$f":"SUM(M72:M82)+M84","v":0}]
["TOTAL ASSESSED EXISTING COMMITMENTS",{"$nulls":3},{"$f":"E83+E86","v":0},{"$nulls":3},{"$f":"I83+I86","v":0},{"$nulls":3},{"$f":"M83+M86","v":0}]
[]
["Loan Details"]
["Application #",null,"App# 1",null,"App# 2",null,"App# 3",null,"App# 4",null,"App# 5",null,"App# 6"]
["New Loan Amount",null,0,null,0,null,0,null,0,null,0,null,0]
["Repayment Type",null,"Amortising",null,"Amortising",null,"Amortising",null,"Amortising",null,"Amortising",null,"Amortising"]
["Loan Term (Years)",null,30,null,30,null,30,null,30,null,30,null,30]
["Interest Only Term (Years)",null,0,null,0,null,0,null,0,null,0,null,0]
[]
["Interest Rate",null,{"v":0.05,"d":"5.00%"},null,{"v":0.05,"d":"5.00%"},null,{"v":0.05,"d":"5.00%"},null,{"v":0.05,"d":"5.00%"},null,{"v":0.05,"d":"5.00%"},null,{"v":0.05,"d":"5.00%"}]
["Sensitivity",null,{"$f":"MAX(List!B15:B16)-C96","v":{"v":0.020000000000000004,"d":"2.00%"}},null,{"$f":"MAX(List!C15:C16)-E96","v":{"v":0.020000000000000004,"d":"2.00%"}},null,{"$f":"MAX(List!D15:D16)-G96","v":{"v":0.020000000000000004,"d":"2.00%"}},null,{"$f":"MAX(List!E15:E16)-I96","v":{"v":0.020000000000000004,"d":"2.00%"}},null,{"$f":"MAX(List!F15:F16)-K96","v":{"v":0.020000000000000004,"d":"2.00%"}},null,{"$f":"MAX(List!G15:G16)-M96","v":{"v":0.020000000000000004,"d":"2.00%"}}]
["Assessment Rate",null,{"$f":"C96+C97","v":{"v":0.07,"d":"7.00%"}},null,{"$f":"E96+E97","v":{"v":0.07,"d":"7.00%"}},null,{"$f":"G96+G97","v":{"v":0.07,"d":"7.00%"}},null,{"$f":"I96+I97","v":{"v":0.07,"d":"7.00%"}},null,{"$f":"K96+K97","v":{"v":0.07,"d":"7.00%"}},null,{"$f":"M96+M97","v":{"v":0.07,"d":"7.00%"}}]
[]
["Monthly Loan Repayment",null,{"$f":"IFERROR(IF(C92=\"Amortising\",-PMT(C96/12,(C93-C94)*12,C91,0,0),C91*C96/12),\"\")","v":0},null,{"$f":"IFERROR(IF(E92=\"Amortising\",-PMT(E96/12,(E93-E94)*12,E91,0,0),E91*E96/12),\"\")","v":0},null,{"$f":"IFERROR(IF(G92=\"Amortising\",-PMT(G96/12,(G93-G94)*12,G91,0,0),G91*G96/12),\"\")","v":0},null,{"$f":"IFERROR(IF(I92=\"Amortising\",-PMT(I96/12,(I93-I94)*12,I91,0,0),I91*I96/12),\"\")","v":0},null,{"$f":"IFERROR(IF(K92=\"Amortising\",-PMT(K96/12,(K93-K94)*12,K91,0,0),K91*K96/12),\"\")","v":0},null,{"$f":"IFERROR(IF(M92=\"Amortising\",-PMT(M96/12,(M93-M94)*12,M91,0,0),M91*M96/12),\"\")","v":0}]
["Monthly Assessed Repayment",null,{"$f":"IFERROR(IF(C92=\"Amortising\",-PMT(C98/12,(C93-C94)*12,C91,0,0),C91*C98/12),\"\")","v":0},null,{"$f":"IFERROR(IF(E92=\"Amortising\",-PMT(E98/12,(E93-E94)*12,E91,0,0),E91*E98/12),\"\")","v":0},null,{"$f":"IFERROR(IF(G92=\"Amortising\",-PMT(G98/12,(G93-G94)*12,G91,0,0),G91*G98/12),\"\")","v":0},null,{"$f":"IFERROR(IF(I92=\"Amortising\",-PMT(I98/12,(I93-I94)*12,I91,0,0),I91*I98/12),\"\")","v":0},null,{"$f":"IFERROR(IF(K92=\"Amortising\",-PMT(K98/12,(K93-K94)*12,K91,0,0),K91*K98/12),\"\")","v":0},null,{"$f":"IFERROR(IF(M92=\"Amortising\",-PMT(M98/12,(M93-M94)*12,M91,0,0),M91*M98/12),\"\")","v":0}]
[]
["Results"]
[]
[null,null,"Household / Company 1",{"$nulls":3},"Household / Company 2",{"$nulls":3},"Household / Company 3"]
["Annual Net Income",null,{"$f":"SUMIF($C$11:$M$11,1,$C$27:$M$27)*12","v":0},null,{"$f":"IFERROR(IF(C110>=0,\"PASS\",\"FAIL\"),\"\")","v":"PASS"},null,{"$f":"SUMIF($C$11:$M$11,2,$C$27:$M$27)*12","v":0},null,{"$f":"IFERROR(IF(G110>=0,\"PASS\",\"FAIL\"),\"\")","v":"PASS"},null,{"$f":"SUMIF($C$11:$M$11,3,$C$27:$M$27)*12","v":0},null,{"$f":"IFERROR(IF(K110>=0,\"PASS\",\"FAIL\"),\"\")","v":"PASS"}]
["Annual Living Expenses",null,{"$f":"E67*12","v":0},{"$nulls":3},{"$f":"I67*12","v":0},{"$nulls":3},{"$f":"M67*12","v":0}]
["Annual Existing Commitments",null,{"$f":"E87*12","v":0},{"$nulls":3},{"$f":"I87*12","v":0},{"$nulls":3},{"$f":"M87*12","v":0}]
["Annual Proposed Repayments",null,{"$f":"(C101+E101+G101+I101+K101+M101)*12","v":0},{"$nulls":3},{"$f":"(E101+G101+I101+K101+M101+O101)*12","v":0},{"$nulls":3},{"$f":"(G101+I101+K101+M101+O101+Q101)*12","v":0}]
["Annual Net Surplus Income:",null,{"$f":"IFERROR(C106-C107-C108-C109,\"\")","v":0},{"$nulls":3},{"$f":"IFERROR(G106-G107-G108-G109,\"\")","v":0},{"$nulls":3},{"$f":"IFERROR(K106-K107-K108-K109,\"\")","v":0}]
[]
["Proposed Future Additional Annual Contributions",null,"Member 1",null,"Member 2",null,"Member 3",null,"Member 4",null,"Member 5",null,"Member 6"]
[null,null,0,null,0,null,0,null,0,null,0,null,0]
["Household",null,{"$f":"SUMIF($C$11:$M$11,1,$C$113:$M$113)","v":0},{"$nulls":3},{"$f":"SUMIF($C$11:$M$11,2,$C$113:$M$113)","v":0},{"$nulls":3},{"$f":"SUMIF($C$11:$M$11,3,$C$113:$M$113)","v":0}]
[null,null,{"$f":"IF(C114>C110,\"Surplus income allocation > Household 1 NSI\",\"\")","v":""},{"$nulls":3},{"$f":"IF(G114>G110,\"Surplus income allocation > Household 2 NSI\",\"\")","v":""},{"$nulls":3},{"$f":"IF(K114>K110,\"Surplus income allocation > Household 3 NSI\",\"\")","v":""}]
[null,null,{"$f":"K137","v":""}]
[]
[]
[{"$f":"Menu!A21","v":"The information contained in this calculator is provided by LoanOne Pty Ltd ACN  161 283 147, Australian Credit License 501182 for illustrative purposes only and should not be regarded as a prediction, or as personal advice. Calculations are not forecasts or projections but is a tool that may assist you to make your own projections. The calculator is not intended to be a substitute for professional advice. The information in this calculator does not constitute an offer to lend, or imply the product is suitable for clients. Before acting on this general information, your client must consider its appropriateness having regard to their own objectives, financial situation and need and also seek independent financial, legal and taxation advice. No guarantee, warranty, or representation is given or implied as to the reliability or accuracy of the information use to compile each index or each calculation. LoanOne specifically disclaims any liability for any direct, indirect, incidental, consequential, or special damages or for any loss arising out of or in any way connected with the access to, reliance on, or use of this calculator."}]
[]
[]
[]
["Count",null,{"$f":"COUNTIF($C$11:$M$11,C11)","v":0},null,{"$f":"COUNTIF($C$11:$M$11,E11)","v":0},null,{"$f":"COUNTIF($C$11:$M$11,G11)","v":0},null,{"$f":"COUNTIF($C$11:$M$11,I11)","v":0},null,{"$f":"COUNTIF($C$11:$M$11,K11)","v":0},null,{"$f":"COUNTIF($C$11:$M$11,M11)","v":0}]
[]
["Individual (Single)",null,{"$f":"IF(C10=\"Individual (Single)\",IF(C123=1,\"\",IF(C123>1,\"Only 1 Household per Single Applicant\",\"Applicant needs to be assigned a Household\")))","v":false},null,{"$f":"IF(E10=\"Individual (Single)\",IF(E123=1,\"\",IF(E123>1,\"Only 1 Household per Single Applicant\",\"Applicant needs to be assigned a Household\")))","v":false},null,{"$f":"IF(G10=\"Individual (Single)\",IF(G123=1,\"\",IF(G123>1,\"Only 1 Household per Single Applicant\",\"Applicant needs to be assigned a Household\")))","v":false},null,{"$f":"IF(I10=\"Individual (Single)\",IF(I123=1,\"\",IF(I123>1,\"Only 1 Household per Single Applicant\",\"Applicant needs to be assigned a Household\")))","v":false},null,{"$f":"IF(K10=\"Individual (Single)\",IF(K123=1,\"\",IF(K123>1,\"Only 1 Household per Single Applicant\",\"Applicant needs to be assigned a Household\")))","v":false},null,{"$f":"IF(M10=\"Individual (Single)\",IF(M123=1,\"\",IF(M123>1,\"Only 1 Household per Single Applicant\",\"Applicant needs to be assigned a Household\")))","v":false}]
["Individual (Couple)",null,{"$f":"IF(C10=\"Individual (Couple)\",IF(C123=1,\"\",IF(C123=2,\"\",IF(C123>2,\"Only 1 Household per Couple Applicant\",IF(C123<1,\"Applicant needs to be assigned a Household\",)))))","v":false},null,{"$f":"IF(E10=\"Individual (Couple)\",IF(E123=1,\"\",IF(E123=2,\"\",IF(E123>2,\"Only 1 Household per Couple Applicant\",IF(E123<1,\"Applicant needs to be assigned a Household\",)))))","v":false},null,{"$f":"IF(G10=\"Individual (Couple)\",IF(G123=1,\"\",IF(G123=2,\"\",IF(G123>2,\"Only 1 Household per Couple Applicant\",IF(G123<1,\"Applicant needs to be assigned a Household\",)))))","v":false},null,{"$f":"IF(I10=\"Individual (Couple)\",IF(I123=1,\"\",IF(I123=2,\"\",IF(I123>2,\"Only 1 Household per Couple Applicant\",IF(I123<1,\"Applicant needs to be assigned a Household\",)))))","v":false},null,{"$f":"IF(K10=\"Individual (Couple)\",IF(K123=1,\"\",IF(K123=2,\"\",IF(K123>2,\"Only 1 Household per Couple Applicant\",IF(K123<1,\"Applicant needs to be assigned a Household\",)))))","v":false},null,{"$f":"IF(M10=\"Individual (Couple)\",IF(M123=1,\"\",IF(M123=2,\"\",IF(M123>2,\"Only 1 Household per Couple Applicant\",IF(M123<1,\"Applicant needs to be assigned a Household\",)))))","v":false}]
["n/a",null,{"$f":"IF(C10=\"n/a\",IF(C123>0,\"Household should only be applied where an applicant exists\",\"\"))","v":""},null,{"$f":"IF(E10=\"n/a\",IF(E123>0,\"Household should only be applied where an applicant exists\",\"\"))","v":""},null,{"$f":"IF(G10=\"n/a\",IF(G123>0,\"Household should only be applied where an applicant exists\",\"\"))","v":""},null,{"$f":"IF(I10=\"n/a\",IF(I123>0,\"Household should only be applied where an applicant exists\",\"\"))","v":""},null,{"$f":"IF(K10=\"n/a\",IF(K123>0,\"Household should only be applied where an applicant exists\",\"\"))","v":""},null,{"$f":"IF(M10=\"n/a\",IF(M123>0,\"Household should only be applied where an applicant exists\",\"\"))","v":""}]
["Company",null,{"$f":"IF(C10=\"Company\",IF(C123>0,\"Household should not be applied to a Company Applicant\",\"\"))","v":false},null,{"$f":"IF(E10=\"Company\",IF(E123>0,\"Household should not be applied to a Company Applicant\",\"\"))","v":false},null,{"$f":"IF(G10=\"Company\",IF(G123>0,\"Household should not be applied to a Company Applicant\",\"\"))","v":false},null,{"$f":"IF(I10=\"Company\",IF(I123>0,\"Household should not be applied to a Company Applicant\",\"\"))","v":false},null,{"$f":"IF(K10=\"Company\",IF(K123>0,\"Household should not be applied to a Company Applicant\",\"\"))","v":false},null,{"$f":"IF(M10=\"Company\",IF(M123>0,\"Household should not be applied to a Company Applicant\",\"\"))","v":false}]
["Error Message",null,{"$f":"IFERROR(VLOOKUP(C10,$A$125:$M$128,3,FALSE),\"\")","v":""},null,{"$f":"IFERROR(VLOOKUP(E10,$A$125:$M$128,5,FALSE),\"\")","v":""},null,{"$f":"IFERROR(VLOOKUP(G10,$A$125:$M$128,7,FALSE),\"\")","v":""},null,{"$f":"IFERROR(VLOOKUP(I10,$A$125:$M$128,9,FALSE),\"\")","v":""},null,{"$f":"IFERROR(VLOOKUP(K10,$A$125:$M$128,11,FALSE),\"\")","v":""},null,{"$f":"IFERROR(VLOOKUP(M10,$A$125:$M$128,13,FALSE),\"\")","v":""}]
[]
["Household",null,1,null,2,null,3]
["Household Count",null,{"$f":"COUNTIF($C$11:$M$11,C131)","v":0},null,{"$f":"COUNTIF($C$11:$M$11,E131)","v":0},null,{"$f":"COUNTIF($C$11:$M$11,G131)","v":0}]
["Expense Error",null,{"$f":"IF(C132=0,IF(E38>0,\"Household 1 has not been assigned to an applicant\",\"\"),IF(E38<E37,\"Monthly living expenses are less than benchmark, detailed explanation required\",\"\"))","v":""},null,{"$f":"IF(E132=0,IF(I38>0,\"Household 1 has not been assigned to an applicant\",\"\"),IF(I38<I37,\"Monthly living expenses are less than benchmark, detailed explanation required\",\"\"))","v":""},null,{"$f":"IF(G132=0,IF(M38>0,\"Household 1 has not been assigned to an applicant\",\"\"),IF(M38<M37,\"Monthly living expenses are less than benchmark, detailed explanation required\",\"\"))","v":""}]
["Bank Statements",null,{"$f":"C40+G40+K40","v":0}]
["Bank Statements",null,{"$f":"IFERROR(C106-C134-C108-C109,\"\")","v":0}]
[]
["Error Message",null,{"$f":"IF(C135<0,\"Where borrower/s are individuals, 3 months banks statements / transaction statements required to support loan application\",\"\")","v":""},{"$nulls":7},{"$f":"C137","v":""}]

{"sheet":"LeaseDoc","index":9,"n_rows":26,"n_cols":7,"rows_kept":26,"hidden":true,"merged":[[0,0,1,4],[2,0,2,3],[2,4,2,6],[4,2,4,4],[22,6,23,6],[25,0,25,8]]}
[]
[]
[" Lease Doc Serviceability Calculator",{"$nulls":3},{"$f":"Menu!A6","v":"Version 1.18 (1 September 2023)"}]
[]
["Application Name:"]
["Applicant #:"]
[]
["Loan Details"]
[]
["Monthly Net Rental Income (Security)",null,0,null,"Annual Net Rental Income",null,{"$f":"C10*12","v":0}]
[]
["New Loan Amount",null,0,null,"Interest Rate",5,{"v":0.05,"d":"5.00%"}]
["Repayment Type",null,"Amortising"]
["Loan Term",null,30]
["Interest Only Term",null,0,null,"Monthly Loan Repayment",null,{"$f":"IF(C13=\"Amortising\",-PMT(G12/12,(C14-C15)*12,C12,0,0),C12*G12/12)","v":0}]
[]
[]
[]
["Results"]
[]
[null,null,"Monthly"]
["Net Income",null,{"$f":"C10","v":0},null,"Interest Cover Ratio",null,{"$f":"IFERROR(C22/C23,\"\")","v":""}]
["Loan Repayment",null,{"$f":"G15","v":0},null,"Maximum Loan:",null,{"$f":"IF(G22>=1.4,\"PASS\",IF(G22>=1.25,\"FAIL\",\"FAIL\"))","v":"PASS"}]
[]
[]
[{"$f":"Menu!A21","v":"The information contained in this calculator is provided by LoanOne Pty Ltd ACN  161 283 147, Australian Credit License 501182 for illustrative purposes only and should not be regarded as a prediction, or as personal advice. Calculations are not forecasts or projections but is a tool that may assist you to make your own projections. The calculator is not intended to be a substitute for professional advice. The information in this calculator does not constitute an offer to lend, or imply the product is suitable for clients. Before acting on this general information, your client must consider its appropriateness having regard to their own objectives, financial situation and need and also seek independent financial, legal and taxation advice. No guarantee, warranty, or representation is given or implied as to the reliability or accuracy of the information use to compile each index or each calculation. LoanOne specifically disclaims any liability for any direct, indirect, incidental, consequential, or special damages or for any loss arising out of or in any way connected with the access to, reliance on, or use of this calculator."}]

{"sheet":"Tax Tables","index":10,"n_rows":92,"n_cols":19,"rows_kept":92,"hidden":true,"merged":[[5,6,5,7],[5,8,5,9],[5,10,5,11],[5,12,5,13],[5,14,5,15],[5,16,5,17]]}
["Rental Income Allowable %",null,null,{"v":0.8,"d":"80%"}]
["Company Tax Rate %",null,null,{"v":0.275,"d":"27.50%"}]
["SMSF Investment Returns",null,null,{"v":0.03,"d":"3.0%"}]
["SMSF Contributions Tax",null,null,{"v":0.15,"d":"15.0%"}]
["LeaseDoc ICR",null,null,{"v":1.5,"d":"1.50"}]
["Individual Tax Calculator",{"$nulls":5},"Applicant 1",null,"Applicant 2",null,"Applicant 3",null,"Applicant 4",null,"Applicant 5",null,"Applicant 6"]
["Rental Income Gearing / (Negative Gearing)",{"$nulls":5},{"$f":"(Residential!C18*$D$1)-(Residential!C19)-(Residential!C20)","v":0},null,{"$f":"(Residential!E18*$D$1)-(Residential!E19)-(Residential!E20)","v":0},null,{"$f":"(Residential!G18*$D$1)-(Residential!G19)-(Residential!G20)","v":0},null,{"$f":"(Residential!I18*$D$1)-(Residential!I19)-(Residential!I20)","v":0},null,{"$f":"(Residential!K18*$D$1)-(Residential!K19)-(Residential!K29)","v":0},null,{"$f":"(Residential!M18*$D$1)-(Residential!M19)-(Residential!M20)","v":0}]
[]
["Gross Annual Income",{"$nulls":5},{"$f":"Residential!C15","v":0},null,{"$f":"Residential!E15","v":0},null,{"$f":"Residential!G15","v":0},null,{"$f":"Residential!I15","v":0},null,{"$f":"Residential!K15","v":0},null,{"$f":"Residential!M15","v":0}]
[]
["Gross Taxable Income",{"$nulls":3},"Tax Rate",null,{"$f":"G7+G9","v":0},null,{"$f":"I7+I9","v":0},null,{"$f":"K7+K9","v":0},null,{"$f":"M7+M9","v":0},null,{"$f":"O7+O9","v":0},null,{"$f":"Q7+Q9","v":0}]
[null,0,{"v":18200,"d":"$18,200"},null,{"v":0,"d":"0.0%"},null,{"$f":"IF(G11>$C$12,$C$12,G11)","v":0},{"$f":"$E$12*G12","v":0},{"$f":"IF(I11>$C$12,$C$12,I11)","v":0},{"$f":"$E$12*I12","v":0},{"$f":"IF(K11>$C$12,$C$12,K11)","v":0},{"$f":"$E$12*K12","v":0},{"$f":"IF(M11>$C$12,$C$12,M11)","v":0},{"$f":"$E$12*M12","v":0},{"$f":"IF(O11>$C$12,$C$12,O11)","v":0},{"$f":"$E$12*O12","v":0},{"$f":"IF(Q11>$C$12,$C$12,Q11)","v":0},{"$f":"$E$12*Q12","v":0}]
[null,{"v":18201,"d":"$18,201"},{"v":45000,"d":"$45,000"},null,{"v":0.19,"d":"19.0%"},null,{"$f":"IF(G12=$C$12,IF(G$11>$C$13,$C$13-$C$12,G$11-$C$12),0)","v":0},{"$f":"$E$13*G13","v":0},{"$f":"IF(I12=$C$12,IF(I$11>$C$13,$C$13-$C$12,I$11-$C$12),0)","v":0},{"$f":"$E$13*I13","v":0},{"$f":"IF(K12=$C$12,IF(K$11>$C$13,$C$13-$C$12,K$11-$C$12),0)","v":0},{"$f":"$E$13*K13","v":0},{"$f":"IF(M12=$C$12,IF(M$11>$C$13,$C$13-$C$12,M$11-$C$12),0)","v":0},{"$f":"$E$13*M13","v":0},{"$f":"IF(O12=$C$12,IF(O$11>$C$13,$C$13-$C$12,O$11-$C$12),0)","v":0},{"$f":"$E$13*O13","v":0},{"$f":"IF(Q12=$C$12,IF(Q$11>$C$13,$C$13-$C$12,Q$11-$C$12),0)","v":0},{"$f":"$E$13*Q13","v":0}]
[null,{"v":45001,"d":"$45,001"},{"v":120000,"d":"$120,000"},null,{"v":0.325,"d":"32.5%"},null,{"$f":"IF(G13+G12=$C$13,IF(G$11>$C$14,$C$14-$C$13,G$11-$C$13),0)","v":0},{"$f":"$E$14*G14","v":0},{"$f":"IF(I13+I12=$C$13,IF(I$11>$C$14,$C$14-$C$13,I$11-$C$13),0)","v":0},{"$f":"$E$14*I14","v":0},{"$f":"IF(K13+K12=$C$13,IF(K$11>$C$14,$C$14-$C$13,K$11-$C$13),0)","v":0},{"$f":"$E$14*K14","v":0},{"$f":"IF(M13+M12=$C$13,IF(M$11>$C$14,$C$14-$C$13,M$11-$C$13),0)","v":0},{"$f":"$E$14*M14","v":0},{"$f":"IF(O13+O12=$C$13,IF(O$11>$C$14,$C$14-$C$13,O$11-$C$13),0)","v":0},{"$f":"$E$14*O14","v":0},{"$f":"IF(Q13+Q12=$C$13,IF(Q$11>$C$14,$C$14-$C$13,Q$11-$C$13),0)","v":0},{"$f":"$E$14*Q14","v":0}]
[null,{"v":120001,"d":"$120,001"},{"v":180000,"d":"$180,000"},null,{"v":0.37,"d":"37.0%"},null,{"$f":"IF(G14+G13+G12=$C$14,IF(G$11>$C$15,$C$15-$C$14,G$11-$C$14),0)","v":0},{"$f":"$E$15*G15","v":0},{"$f":"IF(I14+I13+I12=$C$14,IF(I$11>$C$15,$C$15-$C$14,I$11-$C$14),0)","v":0},{"$f":"$E$15*I15","v":0},{"$f":"IF(K14+K13+K12=$C$14,IF(K$11>$C$15,$C$15-$C$14,K$11-$C$14),0)","v":0},{"$f":"$E$15*K15","v":0},{"$f":"IF(M14+M13+M12=$C$14,IF(M$11>$C$15,$C$15-$C$14,M$11-$C$14),0)","v":0},{"$f":"$E$15*M15","v":0},{"$f":"IF(O14+O13+O12=$C$14,IF(O$11>$C$15,$C$15-$C$14,O$11-$C$14),0)","v":0},{"$f":"$E$15*O15","v":0},{"$f":"IF(Q14+Q13+Q12=$C$14,IF(Q$11>$C$15,$C$15-$C$14,Q$11-$C$14),0)","v":0},{"$f":"$E$15*Q15","v":0}]
[null,{"v":180001,"d":"$180,001"},{"v":100000000,"d":"$100,000,000"},null,{"v":0.45,"d":"45.0%"},null,{"$f":"IF(G15+G14+G13+G12=$C$15,IF(G$11>$C$16,$C$16-$C$15,G$11-$C$15),0)","v":0},{"$f":"$E$16*G16","v":0},{"$f":"IF(I15+I14+I13+I12=$C$15,IF(I$11>$C$16,$C$16-$C$15,I$11-$C$15),0)","v":0},{"$f":"$E$16*I16","v":0},{"$f":"IF(K15+K14+K13+K12=$C$15,IF(K$11>$C$16,$C$16-$C$15,K$11-$C$15),0)","v":0},{"$f":"$E$16*K16","v":0},{"$f":"IF(M15+M14+M13+M12=$C$15,IF(M$11>$C$16,$C$16-$C$15,M$11-$C$15),0)","v":0},{"$f":"$E$16*M16","v":0},{"$f":"IF(O15+O14+O13+O12=$C$15,IF(O$11>$C$16,$C$16-$C$15,O$11-$C$15),0)","v":0},{"$f":"$E$16*O16","v":0},{"$f":"IF(Q15+Q14+Q13+Q12=$C$15,IF(Q$11>$C$16,$C$16-$C$15,Q$11-$C$15),0)","v":0},{"$f":"$E$16*Q16","v":0}]
[{"$nulls":4},"Taxable IncomeTotals:",null,{"$f":"SUM(G12:G16)","v":0},{"$f":"SUM(H12:H16)","v":0},0,0,0,0,0,0,0,0,0,0]
[]
["Low & Middle Income Tax Offset table",null,null,"Tax Offset","Tax Offset %"]
[null,0,{"v":37000,"d":"$37,000"},0,null,null,{"$f":"IF(G$11>$C$20,$C$20,G$11)","v":0},{"$f":"IF(G$11<$C$20+0.01,$D$20,0)","v":0},{"$f":"IF(I$11>$C$20,$C$20,I$11)","v":0},{"$f":"IF(I$11<$C$20+0.01,$D$20,0)","v":0},{"$f":"IF(K$11>$C$20,$C$20,K$11)","v":0},{"$f":"IF(K$11<$C$20+0.01,$D$20,0)","v":0},{"$f":"IF(M$11>$C$20,$C$20,M$11)","v":0},{"$f":"IF(M$11<$C$20+0.01,$D$20,0)","v":0},{"$f":"IF(O$11>$C$20,$C$20,O$11)","v":0},{"$f":"IF(O$11<$C$20+0.01,$D$20,0)","v":0},{"$f":"IF(Q$11>$C$20,$C$20,Q$11)","v":0},{"$f":"IF(Q$11<$C$20+0.01,$D$20,0)","v":0},"does not exceed $37,000, you will be entitled to an offset amount of $255 on your tax payable."]
[null,{"v":37001,"d":"$37,001"},{"v":48000,"d":"$48,000"},0,{"v":0.075,"d":"7.50%"},null,{"$f":"IF(G20=$C$20,IF(G$11>$C$21,$C$21-$C$20,G$11-$C$20),0)","v":0},{"$f":"IF(G21=0,0,IF(G$11<$C$21+0.01,(((G$11-$C$20)*$E$21)+$D$21),0))","v":0},{"$f":"IF(I20=$C$20,IF(I$11>$C$21,$C$21-$C$20,I$11-$C$20),0)","v":0},{"$f":"IF(I21=0,0,IF(I$11<$C$21+0.01,(((I$11-$C$20)*$E$21)+$D$21),0))","v":0},{"$f":"IF(K20=$C$20,IF(K$11>$C$21,$C$21-$C$20,K$11-$C$20),0)","v":0},{"$f":"IF(K21=0,0,IF(K$11<$C$21+0.01,(((K$11-$C$20)*$E$21)+$D$21),0))","v":0},{"$f":"IF(M20=$C$20,IF(M$11>$C$21,$C$21-$C$20,M$11-$C$20),0)","v":0},{"$f":"IF(M21=0,0,IF(M$11<$C$21+0.01,(((M$11-$C$20)*$E$21)+$D$21),0))","v":0},{"$f":"IF(O20=$C$20,IF(O$11>$C$21,$C$21-$C$20,O$11-$C$20),0)","v":0},{"$f":"IF(O21=0,0,IF(O$11<$C$21+0.01,(((O$11-$C$20)*$E$21)+$D$21),0))","v":0},{"$f":"IF(Q20=$C$20,IF(Q$11>$C$21,$C$21-$C$20,Q$11-$C$20),0)","v":0},{"$f":"IF(Q21=0,0,IF(Q$11<$C$21+0.01,(((Q$11-$C$20)*$E$21)+$D$21),0))","v":0},"exceeds $37,000 but is not more than $48,000, you will be entitled to an offset amount of $255, plus 7.5% of the excess above $37,000 to a maximum offset of $1,080 on your tax payable."]
[null,{"v":48001,"d":"$48,001"},{"v":90000,"d":"$90,000"},0,null,null,{"$f":"IF(G21+G20=$C$21,IF(G$11>$C$22,$C$22-$C$21,G$11-$C$21),0)","v":0},{"$f":"IF(G22=0,0,IF(G$11<$C$22+0.01,(((G$11-$C$21)*$E$22)+$D$22),0))","v":0},{"$f":"IF(I21+I20=$C$21,IF(I$11>$C$22,$C$22-$C$21,I$11-$C$21),0)","v":0},{"$f":"IF(I22=0,0,IF(I$11<$C$22+0.01,(((I$11-$C$21)*$E$22)+$D$22),0))","v":0},{"$f":"IF(K21+K20=$C$21,IF(K$11>$C$22,$C$22-$C$21,K$11-$C$21),0)","v":0},{"$f":"IF(K22=0,0,IF(K$11<$C$22+0.01,(((K$11-$C$21)*$E$22)+$D$22),0))","v":0},{"$f":"IF(M21+M20=$C$21,IF(M$11>$C$22,$C$22-$C$21,M$11-$C$21),0)","v":0},{"$f":"IF(M22=0,0,IF(M$11<$C$22+0.01,(((M$11-$C$21)*$E$22)+$D$22),0))","v":0},{"$f":"IF(O21+O20=$C$21,IF(O$11>$C$22,$C$22-$C$21,O$11-$C$21),0)","v":0},{"$f":"IF(O22=0,0,IF(O$11<$C$22+0.01,(((O$11-$C$21)*$E$22)+$D$22),0))","v":0},{"$f":"IF(Q21+Q20=$C$21,IF(Q$11>$C$22,$C$22-$C$21,Q$11-$C$21),0)","v":0},{"$f":"IF(Q22=0,0,IF(Q$11<$C$22+0.01,(((Q$11-$C$21)*$E$22)+$D$22),0))","v":0},"exceeds $48,000 but is not more than $90,000, you will be entitled to the maximum offset amount of $1,080 on your tax payable."]
[null,{"v":90001,"d":"$90,001"},{"v":126000,"d":"$126,000"},0,{"v":-0.03,"d":"-3%"},null,{"$f":"IF(G22+G21+G20=$C$22,IF(G$11>$C$23,$C$23-$C$22,G$11-$C$22),0)","v":0},{"$f":"IF(G23=0,0,IF(G$11<$C$23+0.01,(((G$11-$C$22)*$E$23)+$D$23),0))","v":0},{"$f":"IF(I22+I21+I20=$C$22,IF(I$11>$C$23,$C$23-$C$22,I$11-$C$22),0)","v":0},{"$f":"IF(I23=0,0,IF(I$11<$C$23+0.01,(((I$11-$C$22)*$E$23)+$D$23),0))","v":0},{"$f":"IF(K22+K21+K20=$C$22,IF(K$11>$C$23,$C$23-$C$22,K$11-$C$22),0)","v":0},{"$f":"IF(K23=0,0,IF(K$11<$C$23+0.01,(((K$11-$C$22)*$E$23)+$D$23),0))","v":0},{"$f":"IF(M22+M21+M20=$C$22,IF(M$11>$C$23,$C$23-$C$22,M$11-$C$22),0)","v":0},{"$f":"IF(M23=0,0,IF(M$11<$C$23+0.01,(((M$11-$C$22)*$E$23)+$D$23),0))","v":0},{"$f":"IF(O22+O21+O20=$C$22,IF(O$11>$C$23,$C$23-$C$22,O$11-$C$22),0)","v":0},{"$f":"IF(O23=0,0,IF(O$11<$C$23+0.01,(((O$11-$C$22)*$E$23)+$D$23),0))","v":0},{"$f":"IF(Q22+Q21+Q20=$C$22,IF(Q$11>$C$23,$C$23-$C$22,Q$11-$C$22),0)","v":0},{"$f":"IF(Q23=0,0,IF(Q$11<$C$23+0.01,(((Q$11-$C$22)*$E$23)+$D$23),0))","v":0},"exceeds $90,000 but is not more than $126,000, you will be entitled to an offset amount $1,080 less 3% of your taxable income above $90,000."]
[null,{"v":126001,"d":"$126,001"},{"v":100000000,"d":"$100,000,000"},{"$nulls":3},{"$f":"IF(G23+G22+G21+G20=$C$23,IF(G$11>$C$24,$C$24-$C$23,G$11-$C$23),0)","v":0},null,{"$f":"IF(I23+I22+I21+I20=$C$23,IF(I$11>$C$24,$C$24-$C$23,I$11-$C$23),0)","v":0},null,{"$f":"IF(K23+K22+K21+K20=$C$23,IF(K$11>$C$24,$C$24-$C$23,K$11-$C$23),0)","v":0},null,{"$f":"IF(M23+M22+M21+M20=$C$23,IF(M$11>$C$24,$C$24-$C$23,M$11-$C$23),0)","v":0},null,{"$f":"IF(O23+O22+O21+O20=$C$23,IF(O$11>$C$24,$C$24-$C$23,O$11-$C$23),0)","v":0},null,{"$f":"IF(Q23+Q22+Q21+Q20=$C$23,IF(Q$11>$C$24,$C$24-$C$23,Q$11-$C$23),0)","v":0}]
[{"$nulls":4},"Low & Middle Income Tax Offse Totals:",null,{"$f":"SUM(G19:G24)","v":0},0,0,0,0,0,0,0,0,0,0,0]
[]
["Low Income Tax Offset",null,null,"Tax Offset","Tax Offset %"]
[null,0,{"v":37500,"d":"$37,500"},700,null,null,{"$f":"IF(G$11>$C$28,$C$28,G$11)","v":0},{"$f":"IF(G$11<$C$28+0.01,$D$28,0)","v":{"v":700,"d":"$700"}},{"$f":"IF(I$11>$C$28,$C$28,I$11)","v":0},{"$f":"IF(I$11<$C$28+0.01,$D$28,0)","v":{"v":700,"d":"$700"}},{"$f":"IF(K$11>$C$28,$C$28,K$11)","v":0},{"$f":"IF(K$11<$C$28+0.01,$D$28,0)","v":{"v":700,"d":"$700"}},{"$f":"IF(M$11>$C$28,$C$28,M$11)","v":0},{"$f":"IF(M$11<$C$28+0.01,$D$28,0)","v":{"v":700,"d":"$700"}},{"$f":"IF(O$11>$C$28,$C$28,O$11)","v":0},{"$f":"IF(O$11<$C$28+0.01,$D$28,0)","v":{"v":700,"d":"$700"}},{"$f":"IF(Q$11>$C$28,$C$28,Q$11)","v":0},{"$f":"IF(Q$11<$C$28+0.01,$D$28,0)","v":{"v":700,"d":"$700"}},"The maximum tax offset of $700 applies if your taxable income is $37,500 or less. \\"]
[null,{"v":37501,"d":"$37,501"},{"v":45000,"d":"$45,000"},700,{"v":-0.05,"d":"-5.00%"},null,{"$f":"IF(G28=$C$28,IF(G$11>$C$29,$C$29-$C$28,G$11-$C$28),0)","v":0},{"$f":"IF(G29=0,0,IF(G$11<$C$29+0.01,(((G$11-$C$28)*$E$29)+$D$29),0))","v":0},{"$f":"IF(I28=$C$28,IF(I$11>$C$29,$C$29-$C$28,I$11-$C$28),0)","v":0},{"$f":"IF(I29=0,0,IF(I$11<$C$29+0.01,(((I$11-$C$28)*$E$29)+$D$29),0))","v":0},{"$f":"IF(K28=$C$28,IF(K$11>$C$29,$C$29-$C$28,K$11-$C$28),0)","v":0},{"$f":"IF(K29=0,0,IF(K$11<$C$29+0.01,(((K$11-$C$28)*$E$29)+$D$29),0))","v":0},{"$f":"IF(M28=$C$28,IF(M$11>$C$29,$C$29-$C$28,M$11-$C$28),0)","v":0},{"$f":"IF(M29=0,0,IF(M$11<$C$29+0.01,(((M$11-$C$28)*$E$29)+$D$29),0))","v":0},{"$f":"IF(O28=$C$28,IF(O$11>$C$29,$C$29-$C$28,O$11-$C$28),0)","v":0},{"$f":"IF(O29=0,0,IF(O$11<$C$29+0.01,(((O$11-$C$28)*$E$29)+$D$29),0))","v":0},{"$f":"IF(Q28=$C$28,IF(Q$11>$C$29,$C$29-$C$28,Q$11-$C$28),0)","v":0},{"$f":"IF(Q29=0,0,IF(Q$11<$C$29+0.01,(((Q$11-$C$28)*$E$29)+$D$29),0))","v":0},"This amount is reduced by 5 cents for each dollar over $37,500 up to $45,000."]
[null,{"v":45001,"d":"$45,001"},{"v":66667,"d":"$66,667"},325,{"v":-0.015,"d":"-1.50%"},null,{"$f":"IF(G29+G28=$C$29,IF(G$11>$C$30,$C$30-$C$29,G$11-$C$29),0)","v":0},{"$f":"IF(G30=0,0,IF(G$11<$C$30+0.01,(((G$11-$C$29)*$E$30)+$D$30),0))","v":0},{"$f":"IF(I29+I28=$C$29,IF(I$11>$C$30,$C$30-$C$29,I$11-$C$29),0)","v":0},{"$f":"IF(I30=0,0,IF(I$11<$C$30+0.01,(((I$11-$C$29)*$E$30)+$D$30),0))","v":0},{"$f":"IF(K29+K28=$C$29,IF(K$11>$C$30,$C$30-$C$29,K$11-$C$29),0)","v":0},{"$f":"IF(K30=0,0,IF(K$11<$C$30+0.01,(((K$11-$C$29)*$E$30)+$D$30),0))","v":0},{"$f":"IF(M29+M28=$C$29,IF(M$11>$C$30,$C$30-$C$29,M$11-$C$29),0)","v":0},{"$f":"IF(M30=0,0,IF(M$11<$C$30+0.01,(((M$11-$C$29)*$E$30)+$D$30),0))","v":0},{"$f":"IF(O29+O28=$C$29,IF(O$11>$C$30,$C$30-$C$29,O$11-$C$29),0)","v":0},{"$f":"IF(O30=0,0,IF(O$11<$C$30+0.01,(((O$11-$C$29)*$E$30)+$D$30),0))","v":0},{"$f":"IF(Q29+Q28=$C$29,IF(Q$11>$C$30,$C$30-$C$29,Q$11-$C$29),0)","v":0},{"$f":"IF(Q30=0,0,IF(Q$11<$C$30+0.01,(((Q$11-$C$29)*$E$30)+$D$30),0))","v":0},"This amount is reduced by 1.55 cents for each dollar over $45,000 up to $66,667"]
[null,{"v":66668,"d":"$66,668"},{"v":100000000,"d":"$100,000,000"},{"$nulls":3},{"$f":"IF(G29+G28+G30=$C$30,IF(G$11>$C$31,$C$31-$C$30,G$11-$C$30),0)","v":0},{"$f":"IF(G31=0,0,IF(G$11<$C$31+0.01,(((G$11-$C$29)*$E$31)+$D$31),0))","v":0},{"$f":"IF(I29+I28+I30=$C$30,IF(I$11>$C$31,$C$31-$C$30,I$11-$C$30),0)","v":0},{"$f":"IF(I31=0,0,IF(I$11<$C$31+0.01,(((I$11-$C$29)*$E$31)+$D$31),0))","v":0},{"$f":"IF(K29+K28+K30=$C$30,IF(K$11>$C$31,$C$31-$C$30,K$11-$C$30),0)","v":0},{"$f":"IF(K31=0,0,IF(K$11<$C$31+0.01,(((K$11-$C$29)*$E$31)+$D$31),0))","v":0},{"$f":"IF(M29+M28+M30=$C$30,IF(M$11>$C$31,$C$31-$C$30,M$11-$C$30),0)","v":0},{"$f":"IF(M31=0,0,IF(M$11<$C$31+0.01,(((M$11-$C$29)*$E$31)+$D$31),0))","v":0},{"$f":"IF(O29+O28+O30=$C$30,IF(O$11>$C$31,$C$31-$C$30,O$11-$C$30),0)","v":0},{"$f":"IF(O31=0,0,IF(O$11<$C$31+0.01,(((O$11-$C$29)*$E$31)+$D$31),0))","v":0},{"$f":"IF(Q29+Q28+Q30=$C$30,IF(Q$11>$C$31,$C$31-$C$30,Q$11-$C$30),0)","v":0},{"$f":"IF(Q31=0,0,IF(Q$11<$C$31+0.01,(((Q$11-$C$29)*$E$31)+$D$31),0))","v":0}]
[{"$nulls":4},"Low Income Tax Offset Totals:",null,null,{"$f":"SUM(H28:H31)","v":{"v":700,"d":"$700"}},null,{"$f":"SUM(J28:J31)","v":{"v":700,"d":"$700"}},null,{"$f":"SUM(L28:L31)","v":{"v":700,"d":"$700"}},null,{"$f":"SUM(N28:N31)","v":{"v":700,"d":"$700"}},null,{"$f":"SUM(P28:P31)","v":{"v":700,"d":"$700"}},null,{"$f":"SUM(R28:R31)","v":{"v":700,"d":"$700"}}]
[]
[{"$nulls":4},"Total Tax",null,null,{"$f":"IF(H17-H25-H32<0,0,H17-H25-H32)","v":0},null,{"$f":"IF(J17-J25-J32<0,0,J17-J25-J32)","v":0},null,{"$f":"IF(L17-L25-L32<0,0,L17-L25-L32)","v":0},null,{"$f":"IF(N17-N25-N32<0,0,N17-N25-N32)","v":0},null,{"$f":"IF(P17-P25-P32<0,0,P17-P25-P32)","v":0},null,{"$f":"IF(R17-R25-R32<0,0,R17-R25-R32)","v":0}]
[]
["Medicare Levy (Yearly)",{"$nulls":17},"In 2018–19, you do not have to pay the Medicare levy if your taxable income is equal to or less than $22,398"]
[null,0,{"v":24276,"d":"$24,276"},0,{"v":0,"d":"0.0%"},null,{"$f":"IF(G$11>$C$37,$C$37,G$11)","v":0},{"$f":"IF(G$11<$C$37+0.01,$D$37,0)","v":0},{"$f":"IF(I$11>$C$37,$C$37,I$11)","v":0},{"$f":"IF(I$11<$C$37+0.01,$D$37,0)","v":0},{"$f":"IF(K$11>$C$37,$C$37,K$11)","v":0},{"$f":"IF(K$11<$C$37+0.01,$D$37,0)","v":0},{"$f":"IF(M$11>$C$37,$C$37,M$11)","v":0},{"$f":"IF(M$11<$C$37+0.01,$D$37,0)","v":0},{"$f":"IF(O$11>$C$37,$C$37,O$11)","v":0},{"$f":"IF(O$11<$C$37+0.01,$D$37,0)","v":0},{"$f":"IF(Q$11>$C$37,$C$37,Q$11)","v":0},{"$f":"IF(Q$11<$C$37+0.01,$D$37,0)","v":0},"You will pay only part of the Medicare levy if your taxable income is between $22,398 and $27,997 "]
[null,{"v":24276,"d":"$24,276"},{"v":30345,"d":"$30,345"},0,{"v":0.1,"d":"10.0%"},null,{"$f":"IF(G37=$C$37,IF(G$11>$C$38,$C$38-$C$37,G$11-$C$37),0)","v":0},{"$f":"IF(G38=0,0,IF(G$11<$C$38+0.01,(((G$11-$C$37)*$E$38)+$D$38),0))","v":0},{"$f":"IF(I37=$C$37,IF(I$11>$C$38,$C$38-$C$37,I$11-$C$37),0)","v":0},{"$f":"IF(I38=0,0,IF(I$11<$C$38+0.01,(((I$11-$C$37)*$E$38)+$D$38),0))","v":0},{"$f":"IF(K37=$C$37,IF(K$11>$C$38,$C$38-$C$37,K$11-$C$37),0)","v":0},{"$f":"IF(K38=0,0,IF(K$11<$C$38+0.01,(((K$11-$C$37)*$E$38)+$D$38),0))","v":0},{"$f":"IF(M37=$C$37,IF(M$11>$C$38,$C$38-$C$37,M$11-$C$37),0)","v":0},{"$f":"IF(M38=0,0,IF(M$11<$C$38+0.01,(((M$11-$C$37)*$E$38)+$D$38),0))","v":0},{"$f":"IF(O37=$C$37,IF(O$11>$C$38,$C$38-$C$37,O$11-$C$37),0)","v":0},{"$f":"IF(O38=0,0,IF(O$11<$C$38+0.01,(((O$11-$C$37)*$E$38)+$D$38),0))","v":0},{"$f":"IF(Q37=$C$37,IF(Q$11>$C$38,$C$38-$C$37,Q$11-$C$37),0)","v":0},{"$f":"IF(Q38=0,0,IF(Q$11<$C$38+0.01,(((Q$11-$C$37)*$E$38)+$D$38),0))","v":0}]
[null,{"v":30345,"d":"$30,345"},{"v":100000000,"d":"$100,000,000"},{"$f":"C38*2%","v":{"v":606.9,"d":"$606.90"}},{"v":0.02,"d":"2.0%"},null,{"$f":"IF(G38+G37=$C$38,IF(G$11>$C$39,$C$39-$C$38,G$11-$C$38),0)","v":0},{"$f":"IF(G39=0,0,IF(G$11<$C$39+0.01,(((G$11-$C$38)*$E$39)+$D$39),0))","v":0},{"$f":"IF(I38+I37=$C$38,IF(I$11>$C$39,$C$39-$C$38,I$11-$C$38),0)","v":0},{"$f":"IF(I39=0,0,IF(I$11<$C$39+0.01,(((I$11-$C$38)*$E$39)+$D$39),0))","v":0},{"$f":"IF(K38+K37=$C$38,IF(K$11>$C$39,$C$39-$C$38,K$11-$C$38),0)","v":0},{"$f":"IF(K39=0,0,IF(K$11<$C$39+0.01,(((K$11-$C$38)*$E$39)+$D$39),0))","v":0},{"$f":"IF(M38+M37=$C$38,IF(M$11>$C$39,$C$39-$C$38,M$11-$C$38),0)","v":0},{"$f":"IF(M39=0,0,IF(M$11<$C$39+0.01,(((M$11-$C$38)*$E$39)+$D$39),0))","v":0},{"$f":"IF(O38+O37=$C$38,IF(O$11>$C$39,$C$39-$C$38,O$11-$C$38),0)","v":0},{"$f":"IF(O39=0,0,IF(O$11<$C$39+0.01,(((O$11-$C$38)*$E$39)+$D$39),0))","v":0},{"$f":"IF(Q38+Q37=$C$38,IF(Q$11>$C$39,$C$39-$C$38,Q$11-$C$38),0)","v":0},{"$f":"IF(Q39=0,0,IF(Q$11<$C$39+0.01,(((Q$11-$C$38)*$E$39)+$D$39),0))","v":0}]
[{"$nulls":4},"Medicare Levy Totals:",null,null,{"$f":"SUM(H37:H39)","v":0},null,{"$f":"SUM(J37:J39)","v":0},null,{"$f":"SUM(L37:L39)","v":0},null,{"$f":"SUM(N37:N39)","v":0},null,{"$f":"SUM(P37:P39)","v":0},null,{"$f":"SUM(R37:R39)","v":0}]
[]
[{"$nulls":4},"Total Tax",null,null,{"$f":"H34+H40","v":0},null,{"$f":"J34+J40","v":0},null,{"$f":"L34+L40","v":0},null,{"$f":"N34+N40","v":0},null,{"$f":"P34+P40","v":0},null,{"$f":"R34+R40","v":0}]
["HECS/HELP Debt",{"$nulls":5},{"$f":"IF(G7>0,G7+G9,G9)","v":0},null,{"$f":"IF(I7>0,I7+I9,I9)","v":0},null,{"$f":"IF(K7>0,K7+K9,K9)","v":0},null,{"$f":"IF(M7>0,M7+M9,M9)","v":0},null,{"$f":"IF(O7>0,O7+O9,O9)","v":0},null,{"$f":"IF(Q7>0,Q7+Q9,Q9)","v":0}]
[null,0,{"v":51550,"d":"$51,550"},null,{"v":0,"d":"0.0%"},null,{"$f":"IF(G$43>$C44,0,IF(G$43<$B44,0,G$43))","v":0},{"$f":"$E44*G44","v":0},{"$f":"IF(I$43>$C44,0,IF(I$43<$B44,0,I$43))","v":0},{"$f":"$E44*I44","v":0},{"$f":"IF(K$43>$C44,0,IF(K$43<$B44,0,K$43))","v":0},{"$f":"$E44*K44","v":0},{"$f":"IF(M$43>$C44,0,IF(M$43<$B44,0,M$43))","v":0},{"$f":"$E44*M44","v":0},{"$f":"IF(O$43>$C44,0,IF(O$43<$B44,0,O$43))","v":0},{"$f":"$E44*O44","v":0},{"$f":"IF(Q$43>$C44,0,IF(Q$43<$B44,0,Q$43))","v":0},{"$f":"$E44*Q44","v":0}]
[null,{"$f":"C44+0.01","v":{"v":51550.01,"d":"$51,550"}},{"v":59518,"d":"$59,518"},null,{"v":0.01,"d":"1.0%"},null,0,{"$f":"$E45*G45","v":0},0,0,0,{"$f":"$E45*K45","v":0},0,{"$f":"$E45*M45","v":0},0,{"$f":"$E45*O45","v":0},0,{"$f":"$E45*Q45","v":0}]
[null,{"v":59518.01,"d":"$59,518"},{"v":63089,"d":"$63,089"},null,{"v":0.02,"d":"2.0%"},null,0,0,0,0,0,0,0,{"$f":"$E46*M46","v":0},0,0,0,{"$f":"$E46*Q46","v":0}]
[null,{"v":63089.01,"d":"$63,089"},{"v":66875,"d":"$66,875"},null,{"v":0.025,"d":"2.5%"},null,0,0,0,0,0,0,0,{"$f":"$E47*M47","v":0},0,0,0,{"$f":"$E47*Q47","v":0}]
[null,{"v":66875.01,"d":"$66,875"},{"v":70888,"d":"$70,888"},null,{"v":0.03,"d":"3.0%"},null,0,0,0,0,0,0,0,{"$f":"$E48*M48","v":0},0,0,0,{"$f":"$E48*Q48","v":0}]
[null,{"v":70888.01,"d":"$70,888"},{"v":75140,"d":"$75,140"},null,{"v":0.035,"d":"3.5%"},null,0,0,0,0,0,0,0,{"$f":"$E49*M49","v":0},0,0,0,{"$f":"$E49*Q49","v":0}]
[null,{"v":75140.01,"d":"$75,140"},{"v":79649,"d":"$79,649"},null,{"v":0.04,"d":"4.0%"},null,0,0,0,0,0,0,0,{"$f":"$E50*M50","v":0},0,0,0,{"$f":"$E50*Q50","v":0}]
[null,{"v":79649.01,"d":"$79,649"},{"v":84429,"d":"$84,429"},null,{"v":0.045,"d":"4.5%"},null,0,0,0,0,0,0,0,{"$f":"$E51*M51","v":0},0,0,0,{"$f":"$E51*Q51","v":0}]
[null,{"v":84429.01,"d":"$84,429"},{"v":89494,"d":"$89,494"},null,{"v":0.05,"d":"5.0%"},null,0,0,0,0,0,0,0,{"$f":"$E52*M52","v":0},0,0,0,{"$f":"$E52*Q52","v":0}]
[null,{"v":89494.01,"d":"$89,494"},{"v":94865,"d":"$94,865"},null,{"v":0.055,"d":"5.5%"},null,0,0,0,0,0,0,0,{"$f":"$E53*M53","v":0},0,0,0,{"$f":"$E53*Q53","v":0}]
[null,{"v":94865.01,"d":"$94,865"},{"v":100557,"d":"$100,557"},null,{"v":0.06,"d":"6.0%"},null,0,0,0,0,0,0,0,{"$f":"$E54*M54","v":0},0,0,0,{"$f":"$E54*Q54","v":0}]
[null,{"v":100557.01,"d":"$100,557"},{"v":106590,"d":"$106,590"},null,{"v":0.065,"d":"6.5%"},null,0,0,0,0,0,0,0,{"$f":"$E55*M55","v":0},0,0,0,{"$f":"$E55*Q55","v":0}]
[null,{"v":106590.01,"d":"$106,590"},{"v":112985,"d":"$112,985"},null,{"v":0.07,"d":"7.0%"},null,0,0,0,0,0,0,0,{"$f":"$E56*M56","v":0},0,0,0,{"$f":"$E56*Q56","v":0}]
[null,{"v":112985.01,"d":"$112,985"},{"v":119764,"d":"$119,764"},null,{"v":0.075,"d":"7.5%"},null,0,0,0,0,0,0,0,{"$f":"$E57*M57","v":0},0,0,0,{"$f":"$E57*Q57","v":0}]
[null,{"v":119764.01,"d":"$119,764"},{"v":126950,"d":"$126,950"},null,{"v":0.08,"d":"8.0%"},null,0,0,0,0,0,0,0,{"$f":"$E58*M58","v":0},0,0,0,{"$f":"$E58*Q58","v":0}]
[null,{"v":126950.01,"d":"$126,950"},{"v":134568,"d":"$134,568"},null,{"v":0.085,"d":"8.5%"},null,0,0,0,0,0,0,0,{"$f":"$E59*M59","v":0},0,0,0,{"$f":"$E59*Q59","v":0}]
[null,{"v":134568.01,"d":"$134,568"},{"v":142642,"d":"$142,642"},null,{"v":0.09,"d":"9.0%"},null,0,0,0,0,0,0,0,{"$f":"$E60*M60","v":0},0,0,0,{"$f":"$E60*Q60","v":0}]
[null,{"v":142642.01,"d":"$142,642"},{"v":151200,"d":"$151,200"},null,{"v":0.095,"d":"9.5%"},null,0,0,0,0,0,0,0,{"$f":"$E61*M61","v":0},0,0,0,{"$f":"$E61*Q61","v":0}]
[null,{"v":151200.01,"d":"$151,200"},{"v":100000000,"d":"$100,000,000"},null,{"v":0.0999999999999999,"d":"10.0%"},null,0,0,0,0,0,0,0,{"$f":"$E62*M62","v":0},0,0,0,{"$f":"$E62*Q62","v":0}]
[{"$nulls":4},"HECS/HELP DEBT TOTALS:",null,{"$f":"SUM(G44:G62)","v":0},0,0,0,0,0,0,0,0,0,0,0]
[]
[{"$nulls":4},"Total Tax If HECS/HELP Debt",null,null,{"$f":"H42+H63","v":0},null,{"$f":"J42+J63","v":0},null,{"$f":"L42+L63","v":0},null,{"$f":"N42+N63","v":0},null,{"$f":"P42+P63","v":0},null,{"$f":"R42+R63","v":0}]
{"$rows_empty":10}
[null,null,{"v":52974,"d":"$52,974"},{"v":56151,"d":"$56,151"},{"v":0.02,"d":"2.00%"}]
[null,null,{"v":56152,"d":"$56,152"},{"v":59521,"d":"$59,521"},{"v":0.025,"d":"2.50%"}]
[null,null,{"v":59522,"d":"$59,522"},{"v":63092,"d":"$63,092"},{"v":0.03,"d":"3.00%"}]
[null,null,{"v":63093,"d":"$63,093"},{"v":66877,"d":"$66,877"},{"v":0.035,"d":"3.50%"}]
[null,null,{"v":66878,"d":"$66,878"},{"v":70890,"d":"$70,890"},{"v":0.04,"d":"4.00%"}]
[null,null,{"v":70891,"d":"$70,891"},{"v":75144,"d":"$75,144"},{"v":0.045,"d":"4.50%"}]
[null,null,{"v":75145,"d":"$75,145"},{"v":79652,"d":"$79,652"},{"v":0.05,"d":"5.00%"}]
[null,null,{"v":79653,"d":"$79,653"},{"v":84432,"d":"$84,432"},{"v":0.055,"d":"5.50%"}]
[null,null,{"v":84433,"d":"$84,433"},{"v":89498,"d":"$89,498"},{"v":0.06,"d":"6.00%"}]
[null,null,{"v":89499,"d":"$89,499"},{"v":94868,"d":"$94,868"},{"v":0.065,"d":"6.50%"}]
[null,null,{"v":94869,"d":"$94,869"},{"v":100560,"d":"$100,560"},{"v":0.07,"d":"7.00%"}]
[null,null,{"v":100561,"d":"$100,561"},{"v":106593,"d":"$106,593"},{"v":0.075,"d":"7.50%"}]
[null,null,{"v":106594,"d":"$106,594"},{"v":112989,"d":"$112,989"},{"v":0.08,"d":"8.00%"}]
[null,null,{"v":112990,"d":"$112,990"},{"v":119769,"d":"$119,769"},{"v":0.085,"d":"8.50%"}]
[null,null,{"v":119770,"d":"$119,770"},{"v":126955,"d":"$126,955"},{"v":0.09,"d":"9.00%"}]
[null,null,{"v":126956,"d":"$126,956"},{"v":134572,"d":"$134,572"},{"v":0.095,"d":"9.50%"}]
[null,null,{"v":134573,"d":"$134,573"},null,{"v":0.1,"d":"10%"}]

{"sheet":"Tax Tables (C)","index":11,"n_rows":65,"n_cols":17,"rows_kept":65,"hidden":true,"merged":[[5,6,5,7],[5,8,5,9],[5,10,5,11],[5,12,5,13],[5,14,5,15]]}
["Rental Income Allowable %",null,null,{"v":0.8,"d":"80%"}]
["Company Tax Rate %",null,null,{"v":0.275,"d":"27.50%"}]
["SMSF Investment Returns",null,null,{"v":0.03,"d":"3.0%"}]
["SMSF Contributions Tax",null,null,{"v":0.15,"d":"15.0%"}]
["LeaseDoc ICR",null,null,{"v":1.4,"d":"1.40"}]
["Individual Tax Calculator",{"$nulls":5},"Applicant 1",null,"Applicant 2",null,"Applicant 3",null,"Applicant 4",null,"Applicant 5"]
["Rental Income Gearing / (Negative Gearing)",{"$nulls":5},{"$f":"(Commercial!C18*$D$1)-(Commercial!C19)-(Commercial!C20)","v":0},null,{"$f":"(Commercial!E18*$D$1)-(Commercial!E19)-(Commercial!E20)","v":0},null,{"$f":"(Commercial!G18*$D$1)-(Commercial!G19)-(Commercial!G20)","v":0},null,{"$f":"(Commercial!I18*$D$1)-(Commercial!I19)-(Commercial!I20)","v":0},null,{"$f":"(Commercial!K18*$D$1)-(Commercial!K19)-(Commercial!K20)","v":0}]
[]
["Gross Annual Income",{"$nulls":5},{"$f":"Commercial!C15","v":0},null,{"$f":"Commercial!E15","v":0},null,{"$f":"Commercial!G15","v":0},null,{"$f":"Commercial!I15","v":0},null,{"$f":"Commercial!K15","v":0}]
[]
["Gross Taxable Income",{"$nulls":3},"Tax Rate",null,{"$f":"G7+G9","v":0},null,{"$f":"I7+I9","v":0},null,{"$f":"K7+K9","v":0},null,{"$f":"M7+M9","v":0},null,{"$f":"O7+O9","v":0}]
[null,0,{"v":18200,"d":"$18,200"},null,{"v":0,"d":"0.0%"},null,{"$f":"IF(G11>$C$12,$C$12,G11)","v":0},{"$f":"$E$12*G12","v":0},{"$f":"IF(I11>$C$12,$C$12,I11)","v":0},{"$f":"$E$12*I12","v":0},{"$f":"IF(K11>$C$12,$C$12,K11)","v":0},{"$f":"$E$12*K12","v":0},{"$f":"IF(M11>$C$12,$C$12,M11)","v":0},{"$f":"$E$12*M12","v":0},{"$f":"IF(O11>$C$12,$C$12,O11)","v":0},{"$f":"$E$12*O12","v":0}]
[null,{"v":18201,"d":"$18,201"},{"v":45000,"d":"$45,000"},null,{"v":0.19,"d":"19.0%"},null,{"$f":"IF(G12=$C$12,IF(G$11>$C$13,$C$13-$C$12,G$11-$C$12),0)","v":0},{"$f":"$E$13*G13","v":0},{"$f":"IF(I12=$C$12,IF(I$11>$C$13,$C$13-$C$12,I$11-$C$12),0)","v":0},{"$f":"$E$13*I13","v":0},{"$f":"IF(K12=$C$12,IF(K$11>$C$13,$C$13-$C$12,K$11-$C$12),0)","v":0},{"$f":"$E$13*K13","v":0},{"$f":"IF(M12=$C$12,IF(M$11>$C$13,$C$13-$C$12,M$11-$C$12),0)","v":0},{"$f":"$E$13*M13","v":0},{"$f":"IF(O12=$C$12,IF(O$11>$C$13,$C$13-$C$12,O$11-$C$12),0)","v":0},{"$f":"$E$13*O13","v":0}]
[null,{"v":45001,"d":"$45,001"},{"v":120000,"d":"$120,000"},null,{"v":0.325,"d":"32.5%"},null,{"$f":"IF(G13+G12=$C$13,IF(G$11>$C$14,$C$14-$C$13,G$11-$C$13),0)","v":0},{"$f":"$E$14*G14","v":0},{"$f":"IF(I13+I12=$C$13,IF(I$11>$C$14,$C$14-$C$13,I$11-$C$13),0)","v":0},{"$f":"$E$14*I14","v":0},{"$f":"IF(K13+K12=$C$13,IF(K$11>$C$14,$C$14-$C$13,K$11-$C$13),0)","v":0},{"$f":"$E$14*K14","v":0},{"$f":"IF(M13+M12=$C$13,IF(M$11>$C$14,$C$14-$C$13,M$11-$C$13),0)","v":0},{"$f":"$E$14*M14","v":0},{"$f":"IF(O13+O12=$C$13,IF(O$11>$C$14,$C$14-$C$13,O$11-$C$13),0)","v":0},{"$f":"$E$14*O14","v":0}]
[null,{"v":120001,"d":"$120,001"},{"v":180000,"d":"$180,000"},null,{"v":0.37,"d":"37.0%"},null,{"$f":"IF(G14+G13+G12=$C$14,IF(G$11>$C$15,$C$15-$C$14,G$11-$C$14),0)","v":0},{"$f":"$E$15*G15","v":0},{"$f":"IF(I14+I13+I12=$C$14,IF(I$11>$C$15,$C$15-$C$14,I$11-$C$14),0)","v":0},{"$f":"$E$15*I15","v":0},{"$f":"IF(K14+K13+K12=$C$14,IF(K$11>$C$15,$C$15-$C$14,K$11-$C$14),0)","v":0},{"$f":"$E$15*K15","v":0},{"$f":"IF(M14+M13+M12=$C$14,IF(M$11>$C$15,$C$15-$C$14,M$11-$C$14),0)","v":0},{"$f":"$E$15*M15","v":0},{"$f":"IF(O14+O13+O12=$C$14,IF(O$11>$C$15,$C$15-$C$14,O$11-$C$14),0)","v":0},{"$f":"$E$15*O15","v":0}]
[null,{"v":180001,"d":"$180,001"},{"v":100000000,"d":"$100,000,000"},null,{"v":0.45,"d":"45.0%"},null,{"$f":"IF(G15+G14+G13+G12=$C$15,IF(G$11>$C$16,$C$16-$C$15,G$11-$C$15),0)","v":0},{"$f":"$E$16*G16","v":0},{"$f":"IF(I15+I14+I13+I12=$C$15,IF(I$11>$C$16,$C$16-$C$15,I$11-$C$15),0)","v":0},{"$f":"$E$16*I16","v":0},{"$f":"IF(K15+K14+K13+K12=$C$15,IF(K$11>$C$16,$C$16-$C$15,K$11-$C$15),0)","v":0},{"$f":"$E$16*K16","v":0},{"$f":"IF(M15+M14+M13+M12=$C$15,IF(M$11>$C$16,$C$16-$C$15,M$11-$C$15),0)","v":0},{"$f":"$E$16*M16","v":0},{"$f":"IF(O15+O14+O13+O12=$C$15,IF(O$11>$C$16,$C$16-$C$15,O$11-$C$15),0)","v":0},{"$f":"$E$16*O16","v":0}]
[{"$nulls":4},"Taxable IncomeTotals:",null,{"$f":"SUM(G12:G16)","v":0},0,0,0,0,0,0,0,0,0]
[]
["Low & Middle Income Tax Offset table",null,null,"Tax Offset","Tax Offset %"]
[null,0,{"v":37000,"d":"$37,000"},0,null,null,{"$f":"IF(G$11>$C$20,$C$20,G$11)","v":0},{"$f":"IF(G$11<$C$20+0.01,$D$20,0)","v":0},{"$f":"IF(I$11>$C$20,$C$20,I$11)","v":0},{"$f":"IF(I$11<$C$20+0.01,$D$20,0)","v":0},{"$f":"IF(K$11>$C$20,$C$20,K$11)","v":0},{"$f":"IF(K$11<$C$20+0.01,$D$20,0)","v":0},{"$f":"IF(M$11>$C$20,$C$20,M$11)","v":0},{"$f":"IF(M$11<$C$20+0.01,$D$20,0)","v":0},{"$f":"IF(O$11>$C$20,$C$20,O$11)","v":0},{"$f":"IF(O$11<$C$20+0.01,$D$20,0)","v":0},"does not exceed $37,000, you will be entitled to an offset amount of $255 on your tax payable."]
[null,{"v":37001,"d":"$37,001"},{"v":48000,"d":"$48,000"},0,{"v":0.075,"d":"7.50%"},null,{"$f":"IF(G20=$C$20,IF(G$11>$C$21,$C$21-$C$20,G$11-$C$20),0)","v":0},{"$f":"IF(G21=0,0,IF(G$11<$C$21+0.01,(((G$11-$C$20)*$E$21)+$D$21),0))","v":0},{"$f":"IF(I20=$C$20,IF(I$11>$C$21,$C$21-$C$20,I$11-$C$20),0)","v":0},{"$f":"IF(I21=0,0,IF(I$11<$C$21+0.01,(((I$11-$C$20)*$E$21)+$D$21),0))","v":0},{"$f":"IF(K20=$C$20,IF(K$11>$C$21,$C$21-$C$20,K$11-$C$20),0)","v":0},{"$f":"IF(K21=0,0,IF(K$11<$C$21+0.01,(((K$11-$C$20)*$E$21)+$D$21),0))","v":0},{"$f":"IF(M20=$C$20,IF(M$11>$C$21,$C$21-$C$20,M$11-$C$20),0)","v":0},{"$f":"IF(M21=0,0,IF(M$11<$C$21+0.01,(((M$11-$C$20)*$E$21)+$D$21),0))","v":0},{"$f":"IF(O20=$C$20,IF(O$11>$C$21,$C$21-$C$20,O$11-$C$20),0)","v":0},{"$f":"IF(O21=0,0,IF(O$11<$C$21+0.01,(((O$11-$C$20)*$E$21)+$D$21),0))","v":0},"exceeds $37,000 but is not more than $48,000, you will be entitled to an offset amount of $255, plus 7.5% of the excess above $37,000 to a maximum offset of $1,080 on your tax payable."]
[null,{"v":48001,"d":"$48,001"},{"v":90000,"d":"$90,000"},0,null,null,{"$f":"IF(G21+G20=$C$21,IF(G$11>$C$22,$C$22-$C$21,G$11-$C$21),0)","v":0},{"$f":"IF(G22=0,0,IF(G$11<$C$22+0.01,(((G$11-$C$21)*$E$22)+$D$22),0))","v":0},{"$f":"IF(I21+I20=$C$21,IF(I$11>$C$22,$C$22-$C$21,I$11-$C$21),0)","v":0},{"$f":"IF(I22=0,0,IF(I$11<$C$22+0.01,(((I$11-$C$21)*$E$22)+$D$22),0))","v":0},{"$f":"IF(K21+K20=$C$21,IF(K$11>$C$22,$C$22-$C$21,K$11-$C$21),0)","v":0},{"$f":"IF(K22=0,0,IF(K$11<$C$22+0.01,(((K$11-$C$21)*$E$22)+$D$22),0))","v":0},{"$f":"IF(M21+M20=$C$21,IF(M$11>$C$22,$C$22-$C$21,M$11-$C$21),0)","v":0},{"$f":"IF(M22=0,0,IF(M$11<$C$22+0.01,(((M$11-$C$21)*$E$22)+$D$22),0))","v":0},{"$f":"IF(O21+O20=$C$21,IF(O$11>$C$22,$C$22-$C$21,O$11-$C$21),0)","v":0},{"$f":"IF(O22=0,0,IF(O$11<$C$22+0.01,(((O$11-$C$21)*$E$22)+$D$22),0))","v":0},"exceeds $48,000 but is not more than $90,000, you will be entitled to the maximum offset amount of $1,080 on your tax payable."]
[null,{"v":90001,"d":"$90,001"},{"v":126000,"d":"$126,000"},0,{"v":-0.03,"d":"-3%"},null,{"$f":"IF(G22+G21+G20=$C$22,IF(G$11>$C$23,$C$23-$C$22,G$11-$C$22),0)","v":0},{"$f":"IF(G23=0,0,IF(G$11<$C$23+0.01,(((G$11-$C$22)*$E$23)+$D$23),0))","v":0},{"$f":"IF(I22+I21+I20=$C$22,IF(I$11>$C$23,$C$23-$C$22,I$11-$C$22),0)","v":0},{"$f":"IF(I23=0,0,IF(I$11<$C$23+0.01,(((I$11-$C$22)*$E$23)+$D$23),0))","v":0},{"$f":"IF(K22+K21+K20=$C$22,IF(K$11>$C$23,$C$23-$C$22,K$11-$C$22),0)","v":0},{"$f":"IF(K23=0,0,IF(K$11<$C$23+0.01,(((K$11-$C$22)*$E$23)+$D$23),0))","v":0},{"$f":"IF(M22+M21+M20=$C$22,IF(M$11>$C$23,$C$23-$C$22,M$11-$C$22),0)","v":0},{"$f":"IF(M23=0,0,IF(M$11<$C$23+0.01,(((M$11-$C$22)*$E$23)+$D$23),0))","v":0},{"$f":"IF(O22+O21+O20=$C$22,IF(O$11>$C$23,$C$23-$C$22,O$11-$C$22),0)","v":0},{"$f":"IF(O23=0,0,IF(O$11<$C$23+0.01,(((O$11-$C$22)*$E$23)+$D$23),0))","v":0},"exceeds $90,000 but is not more than $126,000, you will be entitled to an offset amount $1,080 less 3% of your taxable income above $90,000."]
[null,{"v":126001,"d":"$126,001"},{"v":100000000,"d":"$100,000,000"},{"$nulls":3},{"$f":"IF(G23+G22+G21+G20=$C$23,IF(G$11>$C$24,$C$24-$C$23,G$11-$C$23),0)","v":0},null,{"$f":"IF(I23+I22+I21+I20=$C$23,IF(I$11>$C$24,$C$24-$C$23,I$11-$C$23),0)","v":0},null,{"$f":"IF(K23+K22+K21+K20=$C$23,IF(K$11>$C$24,$C$24-$C$23,K$11-$C$23),0)","v":0},null,{"$f":"IF(M23+M22+M21+M20=$C$23,IF(M$11>$C$24,$C$24-$C$23,M$11-$C$23),0)","v":0},null,{"$f":"IF(O23+O22+O21+O20=$C$23,IF(O$11>$C$24,$C$24-$C$23,O$11-$C$23),0)","v":0}]
[{"$nulls":4},"Low & Middle Income Tax Offse Totals:",null,{"$f":"SUM(G19:G24)","v":0},0,0,0,0,0,0,0,0,0]
[]
["Low Income Tax Offset",null,null,"Tax Offset","Tax Offset %"]
[null,0,{"v":37500,"d":"$37,500"},700,null,null,{"$f":"IF(G$11>$C$28,$C$28,G$11)","v":0},{"$f":"IF(G$11<$C$28+0.01,$D$28,0)","v":{"v":700,"d":"$700"}},{"$f":"IF(I$11>$C$28,$C$28,I$11)","v":0},{"$f":"IF(I$11<$C$28+0.01,$D$28,0)","v":{"v":700,"d":"$700"}},{"$f":"IF(K$11>$C$28,$C$28,K$11)","v":0},{"$f":"IF(K$11<$C$28+0.01,$D$28,0)","v":{"v":700,"d":"$700"}},{"$f":"IF(M$11>$C$28,$C$28,M$11)","v":0},{"$f":"IF(M$11<$C$28+0.01,$D$28,0)","v":{"v":700,"d":"$700"}},{"$f":"IF(O$11>$C$28,$C$28,O$11)","v":0},{"$f":"IF(O$11<$C$28+0.01,$D$28,0)","v":{"v":700,"d":"$700"}},"The maximum tax offset of $700 applies if your taxable income is $37,500 or less. \\"]
[null,{"v":37501,"d":"$37,501"},{"v":45000,"d":"$45,000"},700,{"v":-0.05,"d":"-5.00%"},null,{"$f":"IF(G28=$C$28,IF(G$11>$C$29,$C$29-$C$28,G$11-$C$28),0)","v":0},{"$f":"IF(G29=0,0,IF(G$11<$C$29+0.01,(((G$11-$C$28)*$E$29)+$D$29),0))","v":0},{"$f":"IF(I28=$C$28,IF(I$11>$C$29,$C$29-$C$28,I$11-$C$28),0)","v":0},{"$f":"IF(I29=0,0,IF(I$11<$C$29+0.01,(((I$11-$C$28)*$E$29)+$D$29),0))","v":0},{"$f":"IF(K28=$C$28,IF(K$11>$C$29,$C$29-$C$28,K$11-$C$28),0)","v":0},{"$f":"IF(K29=0,0,IF(K$11<$C$29+0.01,(((K$11-$C$28)*$E$29)+$D$29),0))","v":0},{"$f":"IF(M28=$C$28,IF(M$11>$C$29,$C$29-$C$28,M$11-$C$28),0)","v":0},{"$f":"IF(M29=0,0,IF(M$11<$C$29+0.01,(((M$11-$C$28)*$E$29)+$D$29),0))","v":0},{"$f":"IF(O28=$C$28,IF(O$11>$C$29,$C$29-$C$28,O$11-$C$28),0)","v":0},{"$f":"IF(O29=0,0,IF(O$11<$C$29+0.01,(((O$11-$C$28)*$E$29)+$D$29),0))","v":0},"This amount is reduced by 5 cents for each dollar over $37,500 up to $45,000."]
[null,{"v":45001,"d":"$45,001"},{"v":66667,"d":"$66,667"},325,{"v":-0.015,"d":"-1.50%"},null,{"$f":"IF(G29+G28=$C$29,IF(G$11>$C$30,$C$30-$C$29,G$11-$C$29),0)","v":0},{"$f":"IF(G30=0,0,IF(G$11<$C$30+0.01,(((G$11-$C$29)*$E$30)+$D$30),0))","v":0},{"$f":"IF(I29+I28=$C$29,IF(I$11>$C$30,$C$30-$C$29,I$11-$C$29),0)","v":0},{"$f":"IF(I30=0,0,IF(I$11<$C$30+0.01,(((I$11-$C$29)*$E$30)+$D$30),0))","v":0},{"$f":"IF(K29+K28=$C$29,IF(K$11>$C$30,$C$30-$C$29,K$11-$C$29),0)","v":0},{"$f":"IF(K30=0,0,IF(K$11<$C$30+0.01,(((K$11-$C$29)*$E$30)+$D$30),0))","v":0},{"$f":"IF(M29+M28=$C$29,IF(M$11>$C$30,$C$30-$C$29,M$11-$C$29),0)","v":0},{"$f":"IF(M30=0,0,IF(M$11<$C$30+0.01,(((M$11-$C$29)*$E$30)+$D$30),0))","v":0},{"$f":"IF(O29+O28=$C$29,IF(O$11>$C$30,$C$30-$C$29,O$11-$C$29),0)","v":0},{"$f":"IF(O30=0,0,IF(O$11<$C$30+0.01,(((O$11-$C$29)*$E$30)+$D$30),0))","v":0},"This amount is reduced by 1.55 cents for each dollar over $45,000 up to $66,667"]
[null,{"v":66668,"d":"$66,668"},{"v":100000000,"d":"$100,000,000"},{"$nulls":3},{"$f":"IF(G29+G28=$C$29,IF(G$11>$C$31,$C$31-$C$29,G$11-$C$29),0)","v":0},{"$f":"IF(G31=0,0,IF(G$11<$C$31+0.01,(((G$11-$C$29)*$E$31)+$D$31),0))","v":0},{"$f":"IF(I29+I28=$C$29,IF(I$11>$C$31,$C$31-$C$29,I$11-$C$29),0)","v":0},{"$f":"IF(I31=0,0,IF(I$11<$C$31+0.01,(((I$11-$C$29)*$E$31)+$D$31),0))","v":0},{"$f":"IF(K29+K28=$C$29,IF(K$11>$C$31,$C$31-$C$29,K$11-$C$29),0)","v":0},{"$f":"IF(K31=0,0,IF(K$11<$C$31+0.01,(((K$11-$C$29)*$E$31)+$D$31),0))","v":0},{"$f":"IF(M29+M28=$C$29,IF(M$11>$C$31,$C$31-$C$29,M$11-$C$29),0)","v":0},{"$f":"IF(M31=0,0,IF(M$11<$C$31+0.01,(((M$11-$C$29)*$E$31)+$D$31),0))","v":0},{"$f":"IF(O29+O28=$C$29,IF(O$11>$C$31,$C$31-$C$29,O$11-$C$29),0)","v":0},{"$f":"IF(O31=0,0,IF(O$11<$C$31+0.01,(((O$11-$C$29)*$E$31)+$D$31),0))","v":0}]
[{"$nulls":4},"Low Income Tax Offset Totals:",null,null,{"$f":"SUM(H28:H31)","v":{"v":700,"d":"$700"}},null,{"$f":"SUM(J28:J31)","v":{"v":700,"d":"$700"}},null,{"$f":"SUM(L28:L31)","v":{"v":700,"d":"$700"}},null,{"$f":"SUM(N28:N31)","v":{"v":700,"d":"$700"}},null,{"$f":"SUM(P28:P31)","v":{"v":700,"d":"$700"}}]
[]
[{"$nulls":4},"Total Tax",null,null,{"$f":"IF(H17-H25-H32<0,0,H17-H25-H32)","v":0},null,{"$f":"IF(J17-J25-J32<0,0,J17-J25-J32)","v":0},null,{"$f":"IF(L17-L25-L32<0,0,L17-L25-L32)","v":0},null,{"$f":"IF(N17-N25-N32<0,0,N17-N25-N32)","v":0},null,{"$f":"IF(P17-P25-P32<0,0,P17-P25-P32)","v":0}]
[]
["Medicare Levy (Yearly)",{"$nulls":15},"In 2018–19, you do not have to pay the Medicare levy if your taxable income is equal to or less than $22,398"]
[null,0,{"v":24276,"d":"$24,276"},0,{"v":0,"d":"0.0%"},null,{"$f":"IF(G$11>$C$37,$C$37,G$11)","v":0},{"$f":"IF(G$11<$C$37+0.01,$D$37,0)","v":0},{"$f":"IF(I$11>$C$37,$C$37,I$11)","v":0},{"$f":"IF(I$11<$C$37+0.01,$D$37,0)","v":0},{"$f":"IF(K$11>$C$37,$C$37,K$11)","v":0},{"$f":"IF(K$11<$C$37+0.01,$D$37,0)","v":0},{"$f":"IF(M$11>$C$37,$C$37,M$11)","v":0},{"$f":"IF(M$11<$C$37+0.01,$D$37,0)","v":0},{"$f":"IF(O$11>$C$37,$C$37,O$11)","v":0},{"$f":"IF(O$11<$C$37+0.01,$D$37,0)","v":0},"You will pay only part of the Medicare levy if your taxable income is between $22,398 and $27,997 "]
[null,{"v":24276,"d":"$24,276"},{"v":30345,"d":"$30,345"},0,{"v":0.1,"d":"10.0%"},null,{"$f":"IF(G37=$C$37,IF(G$11>$C$38,$C$38-$C$37,G$11-$C$37),0)","v":0},{"$f":"IF(G38=0,0,IF(G$11<$C$38+0.01,(((G$11-$C$37)*$E$38)+$D$38),0))","v":0},{"$f":"IF(I37=$C$37,IF(I$11>$C$38,$C$38-$C$37,I$11-$C$37),0)","v":0},{"$f":"IF(I38=0,0,IF(I$11<$C$38+0.01,(((I$11-$C$37)*$E$38)+$D$38),0))","v":0},{"$f":"IF(K37=$C$37,IF(K$11>$C$38,$C$38-$C$37,K$11-$C$37),0)","v":0},{"$f":"IF(K38=0,0,IF(K$11<$C$38+0.01,(((K$11-$C$37)*$E$38)+$D$38),0))","v":0},{"$f":"IF(M37=$C$37,IF(M$11>$C$38,$C$38-$C$37,M$11-$C$37),0)","v":0},{"$f":"IF(M38=0,0,IF(M$11<$C$38+0.01,(((M$11-$C$37)*$E$38)+$D$38),0))","v":0},{"$f":"IF(O37=$C$37,IF(O$11>$C$38,$C$38-$C$37,O$11-$C$37),0)","v":0},{"$f":"IF(O38=0,0,IF(O$11<$C$38+0.01,(((O$11-$C$37)*$E$38)+$D$38),0))","v":0}]
[null,{"v":30345,"d":"$30,345"},{"v":100000000,"d":"$100,000,000"},{"$f":"C38*2%","v":{"v":606.9,"d":"$606.90"}},{"v":0.02,"d":"2.0%"},null,{"$f":"IF(G38+G37=$C$38,IF(G$11>$C$39,$C$39-$C$38,G$11-$C$38),0)","v":0},{"$f":"IF(G39=0,0,IF(G$11<$C$39+0.01,(((G$11-$C$38)*$E$39)+$D$39),0))","v":0},{"$f":"IF(I38+I37=$C$38,IF(I$11>$C$39,$C$39-$C$38,I$11-$C$38),0)","v":0},{"$f":"IF(I39=0,0,IF(I$11<$C$39+0.01,(((I$11-$C$38)*$E$39)+$D$39),0))","v":0},{"$f":"IF(K38+K37=$C$38,IF(K$11>$C$39,$C$39-$C$38,K$11-$C$38),0)","v":0},{"$f":"IF(K39=0,0,IF(K$11<$C$39+0.01,(((K$11-$C$38)*$E$39)+$D$39),0))","v":0},{"$f":"IF(M38+M37=$C$38,IF(M$11>$C$39,$C$39-$C$38,M$11-$C$38),0)","v":0},{"$f":"IF(M39=0,0,IF(M$11<$C$39+0.01,(((M$11-$C$38)*$E$39)+$D$39),0))","v":0},{"$f":"IF(O38+O37=$C$38,IF(O$11>$C$39,$C$39-$C$38,O$11-$C$38),0)","v":0},{"$f":"IF(O39=0,0,IF(O$11<$C$39+0.01,(((O$11-$C$38)*$E$39)+$D$39),0))","v":0}]
[{"$nulls":4},"Medicare Levy Totals:",null,null,{"$f":"SUM(H37:H39)","v":0},null,{"$f":"SUM(J37:J39)","v":0},null,{"$f":"SUM(L37:L39)","v":0},null,{"$f":"SUM(N37:N39)","v":0},null,{"$f":"SUM(P37:P39)","v":0}]
[]
[{"$nulls":4},"Total Tax",null,null,{"$f":"H34+H40","v":0},null,{"$f":"J34+J40","v":0},null,{"$f":"L34+L40","v":0},null,{"$f":"N34+N40","v":0},null,{"$f":"P34+P40","v":0}]
["HECS/HELP Debt",{"$nulls":5},{"$f":"IF(G7>0,G7+G9,G9)","v":0},null,{"$f":"IF(I7>0,I7+I9,I9)","v":0},null,{"$f":"IF(K7>0,K7+K9,K9)","v":0},null,{"$f":"IF(M7>0,M7+M9,M9)","v":0},null,{"$f":"IF(O7>0,O7+O9,O9)","v":0}]
[null,0,{"v":51550,"d":"$51,550"},null,{"v":0,"d":"0.0%"},null,{"$f":"IF(G$43>$C44,0,IF(G$43<$B44,0,G$43))","v":0},{"$f":"$E44*G44","v":0},{"$f":"IF(I$43>$C44,0,IF(I$43<$B44,0,I$43))","v":0},{"$f":"$E44*I44","v":0},{"$f":"IF(K$43>$C44,0,IF(K$43<$B44,0,K$43))","v":0},{"$f":"$E44*K44","v":0},{"$f":"IF(M$43>$C44,0,IF(M$43<$B44,0,M$43))","v":0},{"$f":"$E44*M44","v":0},{"$f":"IF(O$43>$C44,0,IF(O$43<$B44,0,O$43))","v":0},{"$f":"$E44*O44","v":0}]
[null,{"$f":"C44+0.01","v":{"v":51550.01,"d":"$51,550"}},{"v":59518,"d":"$59,518"},null,{"v":0.01,"d":"1.0%"},null,0,{"$f":"$E45*G45","v":0},0,0,0,{"$f":"$E45*K45","v":0},0,{"$f":"$E45*M45","v":0},0,{"$f":"$E45*O45","v":0}]
[null,{"v":59518.01,"d":"$59,518"},{"v":63089,"d":"$63,089"},null,{"v":0.02,"d":"2.0%"},null,0,0,0,0,0,0,0,0,0,0]
[null,{"v":63089.01,"d":"$63,089"},{"v":66875,"d":"$66,875"},null,{"v":0.025,"d":"2.5%"},null,0,0,0,0,0,0,0,0,0,0]
[null,{"v":66875.01,"d":"$66,875"},{"v":70888,"d":"$70,888"},null,{"v":0.03,"d":"3.0%"},null,0,0,0,0,0,0,0,0,0,0]
[null,{"v":70888.01,"d":"$70,888"},{"v":75140,"d":"$75,140"},null,{"v":0.035,"d":"3.5%"},null,0,0,0,0,0,0,0,0,0,0]
[null,{"v":75140.01,"d":"$75,140"},{"v":79649,"d":"$79,649"},null,{"v":0.04,"d":"4.0%"},null,0,0,0,0,0,0,0,0,0,0]
[null,{"v":79649.01,"d":"$79,649"},{"v":84429,"d":"$84,429"},null,{"v":0.045,"d":"4.5%"},null,0,0,0,0,0,0,0,0,0,0]
[null,{"v":84429.01,"d":"$84,429"},{"v":89494,"d":"$89,494"},null,{"v":0.05,"d":"5.0%"},null,0,0,0,0,0,0,0,0,0,0]
[null,{"v":89494.01,"d":"$89,494"},{"v":94865,"d":"$94,865"},null,{"v":0.055,"d":"5.5%"},null,0,0,0,0,0,0,0,0,0,0]
[null,{"v":94865.01,"d":"$94,865"},{"v":100557,"d":"$100,557"},null,{"v":0.06,"d":"6.0%"},null,0,0,0,0,0,0,0,0,0,0]
[null,{"v":100557.01,"d":"$100,557"},{"v":106590,"d":"$106,590"},null,{"v":0.065,"d":"6.5%"},null,0,0,0,0,0,0,0,0,0,0]
[null,{"v":106590.01,"d":"$106,590"},{"v":112985,"d":"$112,985"},null,{"v":0.07,"d":"7.0%"},null,0,0,0,0,0,0,0,0,0,0]
[null,{"v":112985.01,"d":"$112,985"},{"v":119764,"d":"$119,764"},null,{"v":0.075,"d":"7.5%"},null,0,0,0,0,0,0,0,0,0,0]
[null,{"v":119764.01,"d":"$119,764"},{"v":126950,"d":"$126,950"},null,{"v":0.08,"d":"8.0%"},null,0,0,0,0,0,0,0,0,0,0]
[null,{"v":126950.01,"d":"$126,950"},{"v":134568,"d":"$134,568"},null,{"v":0.085,"d":"8.5%"},null,0,0,0,0,0,0,0,0,0,0]
[null,{"v":134568.01,"d":"$134,568"},{"v":142642,"d":"$142,642"},null,{"v":0.09,"d":"9.0%"},null,0,0,0,0,0,0,0,0,0,0]
[null,{"v":142642.01,"d":"$142,642"},{"v":151200,"d":"$151,200"},null,{"v":0.095,"d":"9.5%"},null,0,{"$f":"$E61*G61","v":0},0,0,0,0,0,0,0,0]
[null,{"v":151200.01,"d":"$151,200"},{"v":100000000,"d":"$100,000,000"},null,{"v":0.0999999999999999,"d":"10.0%"},null,0,0,0,0,0,0,0,0,0,0]
[{"$nulls":4},"HECS/HELP DEBT TOTALS:",null,{"$f":"SUM(G44:G62)","v":0},0,0,0,0,0,0,0,0,0]
[]
[{"$nulls":4},"Total Tax If HECS/HELP Debt",null,null,{"$f":"H42+H63","v":0},null,{"$f":"J42+J63","v":0},null,{"$f":"L42+L63","v":0},null,{"$f":"N42+N63","v":0},null,{"$f":"P42+P63","v":0}]

{"sheet":"SMSF Tax Tables","index":12,"n_rows":36,"n_cols":19,"rows_kept":36,"hidden":true,"merged":[[4,6,4,7],[4,8,4,9],[4,10,4,11],[4,12,4,13],[4,14,4,15],[4,16,4,17],[32,0,32,3]]}
["Rental Income Allowable %",null,null,{"v":0.8,"d":"80%"}]
["SMSF Investment Returns",null,null,{"v":0.03,"d":"3.0%"}]
["SMSF Contributions Tax",null,null,{"v":0.15,"d":"15.0%"}]
[]
["Individual Tax Calculator",{"$nulls":5},"Applicant 1",null,"Applicant 2",null,"Applicant 3",null,"Applicant 4",null,"Applicant 5",null,"Applicant 6",null,"Total Tax"]
["Concessional Contributions",{"$nulls":3},"Tax Rate",null,{"$f":"SMSF!C13+SMSF!C15","v":0},null,{"$f":"SMSF!E13+SMSF!E15","v":0},null,{"$f":"SMSF!G13+SMSF!G15","v":0},null,{"$f":"SMSF!I13+SMSF!I15","v":0},null,{"$f":"SMSF!K13+SMSF!K15","v":0},null,{"$f":"SMSF!M13+SMSF!M15","v":0}]
[null,0,{"v":27500,"d":"$27,500"},null,{"v":0.15,"d":"15.0%"},null,{"$f":"IF(G6>$C$7,$C$7,G6)","v":0},{"$f":"$E$7*G7","v":0},{"$f":"IF(I6>$C$7,$C$7,I6)","v":0},{"$f":"$E$7*I7","v":0},{"$f":"IF(K6>$C$7,$C$7,K6)","v":0},{"$f":"$E$7*K7","v":0},{"$f":"IF(M6>$C$7,$C$7,M6)","v":0},{"$f":"$E$7*M7","v":0},{"$f":"IF(O6>$C$7,$C$7,O6)","v":0},{"$f":"$E$7*O7","v":0},{"$f":"IF(Q6>$C$7,$C$7,Q6)","v":0},{"$f":"$E$7*Q7","v":0}]
[null,{"v":27500.01,"d":"$27,500"},{"v":100000000,"d":"$100,000,000"},null,{"v":0.47,"d":"47.0%"},null,{"$f":"IF(G7=$C$7,IF(G$6>$C$8,$C$8-$C$7,G$6-$C$7),0)","v":0},{"$f":"$E$8*G8","v":0},{"$f":"IF(I7=$C$7,IF(I$6>$C$8,$C$8-$C$7,I$6-$C$7),0)","v":0},{"$f":"$E$8*I8","v":0},{"$f":"IF(K7=$C$7,IF(K$6>$C$8,$C$8-$C$7,K$6-$C$7),0)","v":0},{"$f":"$E$8*K8","v":0},{"$f":"IF(M7=$C$7,IF(M$6>$C$8,$C$8-$C$7,M$6-$C$7),0)","v":0},{"$f":"$E$8*M8","v":0},{"$f":"IF(O7=$C$7,IF(O$6>$C$8,$C$8-$C$7,O$6-$C$7),0)","v":0},{"$f":"$E$8*O8","v":0},{"$f":"IF(Q7=$C$7,IF(Q$6>$C$8,$C$8-$C$7,Q$6-$C$7),0)","v":0},{"$f":"$E$8*Q8","v":0}]
[{"$nulls":4},"Concessional ContributionTotals:",null,{"$f":"SUM(G7:G8)","v":0},0,0,0,0,0,0,0,{"$f":"SUM(O7:O8)","v":0},0,0,0]
[]
["Non-Concessional Contributions",{"$nulls":3},"Tax Rate",null,{"$f":"SMSF!C16+SMSF!C17","v":0},null,{"$f":"SMSF!E16+SMSF!E17","v":0},null,{"$f":"SMSF!G16+SMSF!G17","v":0},null,{"$f":"SMSF!I16+SMSF!I17","v":0},null,{"$f":"SMSF!K16+SMSF!K17","v":0},null,{"$f":"SMSF!M16+SMSF!M17","v":0}]
[null,0,{"v":110000,"d":"$110,000"},null,{"v":0,"d":"0.0%"},null,{"$f":"IF(G11>$C$12,$C$12,G11)","v":0},{"$f":"$E$12*G12","v":0},{"$f":"IF(I11>$C$12,$C$12,I11)","v":0},{"$f":"$E$12*I12","v":0},{"$f":"IF(K11>$C$12,$C$12,K11)","v":0},{"$f":"$E$12*K12","v":0},{"$f":"IF(M11>$C$12,$C$12,M11)","v":0},{"$f":"$E$12*M12","v":0},{"$f":"IF(O11>$C$12,$C$12,O11)","v":0},{"$f":"$E$12*O12","v":0},{"$f":"IF(Q11>$C$12,$C$12,Q11)","v":0},{"$f":"$E$12*Q12","v":0}]
[null,{"v":110000.01,"d":"$110,000"},{"v":100000000,"d":"$100,000,000"},null,{"v":0.47,"d":"47.0%"},null,{"$f":"IF(G12=$C$12,IF(G$11>$C$13,$C$13-$C$12,G$11-$C$12),0)","v":0},{"$f":"$E$13*G13","v":0},{"$f":"IF(I12=$C$12,IF(I$11>$C$13,$C$13-$C$12,I$11-$C$12),0)","v":0},{"$f":"$E$13*I13","v":0},{"$f":"IF(K12=$C$12,IF(K$11>$C$13,$C$13-$C$12,K$11-$C$12),0)","v":0},{"$f":"$E$13*K13","v":0},{"$f":"IF(M12=$C$12,IF(M$11>$C$13,$C$13-$C$12,M$11-$C$12),0)","v":0},{"$f":"$E$13*M13","v":0},{"$f":"IF(O12=$C$12,IF(O$11>$C$13,$C$13-$C$12,O$11-$C$12),0)","v":0},{"$f":"$E$13*O13","v":0},{"$f":"IF(Q12=$C$12,IF(Q$11>$C$13,$C$13-$C$12,Q$11-$C$12),0)","v":0},{"$f":"$E$13*Q13","v":0}]
[{"$nulls":4},"Non Concessional Contribution Totals:",null,{"$f":"SUM(G12:G13)","v":0},0,0,0,0,0,0,0,{"$f":"SUM(O12:O13)","v":0},0,0,0]
[{"$nulls":7},{"$f":"H9+H14","v":0},null,{"$f":"J9+J14","v":0},null,{"$f":"L9+L14","v":0},null,{"$f":"N9+N14","v":0},null,{"$f":"P9+P14","v":0},null,{"$f":"R9+R14","v":0},{"$f":"SUM(H15:R15)","v":0}]
[]
["Total Contributions",{"$nulls":5},{"$f":"G9+G14","v":0},null,{"$f":"I9+I14","v":0},null,{"$f":"K9+K14","v":0},null,{"$f":"M9+M14","v":0},null,{"$f":"O9+O14","v":0},null,{"$f":"Q9+Q14","v":0}]
["Concessional Contribution Cap",{"$nulls":3},{"v":27500,"d":"$27,500"}]
["Non Concessional Contribution Cap",{"$nulls":3},{"v":110000,"d":"$110,000"}]
[{"$nulls":6},{"$f":"G$17-$E$18-$E$19","v":{"v":-137500,"d":"-$137,500"}},null,{"$f":"I$17-$E$18-$E$19","v":{"v":-137500,"d":"-$137,500"}},null,{"$f":"K$17-$E$18-$E$19","v":{"v":-137500,"d":"-$137,500"}},null,{"$f":"M$17-$E$18-$E$19","v":{"v":-137500,"d":"-$137,500"}},null,{"$f":"O$17-$E$18-$E$19","v":{"v":-137500,"d":"-$137,500"}},null,{"$f":"Q$17-$E$18-$E$19","v":{"v":-137500,"d":"-$137,500"}}]
[{"$nulls":6},{"$f":"IF(G20>0,\"Non Concessional Contribution Cap Exceeded\",\"\")","v":""},null,{"$f":"IF(I20>0,\"Non Concessional Contribution Cap Exceeded\",\"\")","v":""},null,{"$f":"IF(K20>0,\"Non Concessional Contribution Cap Exceeded\",\"\")","v":""},null,{"$f":"IF(M20>0,\"Non Concessional Contribution Cap Exceeded\",\"\")","v":""},null,{"$f":"IF(O20>0,\"Non Concessional Contribution Cap Exceeded\",\"\")","v":""},null,{"$f":"IF(Q20>0,\"Non Concessional Contribution Cap Exceeded\",\"\")","v":""}]
[]
["Investment Returns",{"$nulls":5},{"$f":"SMSF!G25","v":0},{"$nulls":11},{"$f":"G23*D3","v":0}]
[]
["Rental Income",{"$nulls":5},{"$f":"SMSF!C22+SMSF!C23","v":0}]
["Rental Income (After Haircut)",{"$nulls":5},{"$f":"G25*D1","v":0}]
[]
["Interest Expense",{"$nulls":5},{"$f":"SMSF!G22+SMSF!G23","v":0}]
["Net",{"$nulls":5},{"$f":"G26-G28","v":0}]
["Taxed",{"$nulls":5},{"$f":"G29*D3","v":0},{"$nulls":11},{"$f":"G30","v":0}]
[]
[]
["SMSF Ongoing Expenses (Annual)",{"$nulls":5},{"$f":"-SMSF!C35","v":-2500},{"$nulls":11},{"$f":"G33*D3","v":-375}]
[]
[{"$nulls":12},"Total Tax",{"$nulls":5},{"$f":"S15+S23+S30+S33","v":{"v":-375,"d":"$(375.00)"}}]
[{"$nulls":12},"Tax used in Calculation",{"$nulls":5},{"$f":"IF(S35>0,S35,0)","v":0}]

{"sheet":"Resi SMSF Tax Tables","index":13,"n_rows":92,"n_cols":19,"rows_kept":92,"hidden":true,"merged":[[5,6,5,7],[5,8,5,9],[5,10,5,11],[5,12,5,13],[5,14,5,15],[5,16,5,17]]}
["Rental Income Allowable %",null,null,{"v":0.8,"d":"80%"}]
["Company Tax Rate %",null,null,{"v":0.275,"d":"27.50%"}]
["SMSF Investment Returns",null,null,{"v":0.03,"d":"3.0%"}]
["SMSF Contributions Tax",null,null,{"v":0.15,"d":"15.0%"}]
["LeaseDoc ICR",null,null,{"v":1.5,"d":"1.50"}]
["Individual Tax Calculator",{"$nulls":5},"Applicant 1",null,"Applicant 2",null,"Applicant 3",null,"Applicant 4",null,"Applicant 5",null,"Applicant 6"]
["Rental Income Gearing / (Negative Gearing)",{"$nulls":5},{"$f":"('Residential SMSF'!C18*$D$1)-('Residential SMSF'!C19)-('Residential SMSF'!C20)","v":0},null,{"$f":"('Residential SMSF'!E18*$D$1)-('Residential SMSF'!E19)-('Residential SMSF'!E20)","v":0},null,{"$f":"('Residential SMSF'!G18*$D$1)-('Residential SMSF'!G19)-('Residential SMSF'!G20)","v":0},null,{"$f":"('Residential SMSF'!I18*$D$1)-('Residential SMSF'!I19)-('Residential SMSF'!I20)","v":0},null,{"$f":"('Residential SMSF'!K18*$D$1)-('Residential SMSF'!K19)-('Residential SMSF'!K29)","v":0},null,{"$f":"('Residential SMSF'!M18*$D$1)-('Residential SMSF'!M19)-('Residential SMSF'!M20)","v":0}]
[]
["Gross Annual Income",{"$nulls":5},{"$f":"'Residential SMSF'!C15","v":0},null,{"$f":"'Residential SMSF'!E15","v":0},null,{"$f":"'Residential SMSF'!G15","v":0},null,{"$f":"'Residential SMSF'!I15","v":0},null,{"$f":"'Residential SMSF'!K15","v":0},null,{"$f":"'Residential SMSF'!M15","v":0}]
[]
["Gross Taxable Income",{"$nulls":3},"Tax Rate",null,{"$f":"G7+G9","v":0},null,{"$f":"I7+I9","v":0},null,{"$f":"K7+K9","v":0},null,{"$f":"M7+M9","v":0},null,{"$f":"O7+O9","v":0},null,{"$f":"Q7+Q9","v":0}]
[null,0,{"v":18200,"d":"$18,200"},null,{"v":0,"d":"0.0%"},null,{"$f":"IF(G11>$C$12,$C$12,G11)","v":0},{"$f":"$E$12*G12","v":0},{"$f":"IF(I11>$C$12,$C$12,I11)","v":0},{"$f":"$E$12*I12","v":0},{"$f":"IF(K11>$C$12,$C$12,K11)","v":0},{"$f":"$E$12*K12","v":0},{"$f":"IF(M11>$C$12,$C$12,M11)","v":0},{"$f":"$E$12*M12","v":0},{"$f":"IF(O11>$C$12,$C$12,O11)","v":0},{"$f":"$E$12*O12","v":0},{"$f":"IF(Q11>$C$12,$C$12,Q11)","v":0},{"$f":"$E$12*Q12","v":0}]
[null,{"v":18201,"d":"$18,201"},{"v":45000,"d":"$45,000"},null,{"v":0.19,"d":"19.0%"},null,{"$f":"IF(G12=$C$12,IF(G$11>$C$13,$C$13-$C$12,G$11-$C$12),0)","v":0},{"$f":"$E$13*G13","v":0},{"$f":"IF(I12=$C$12,IF(I$11>$C$13,$C$13-$C$12,I$11-$C$12),0)","v":0},{"$f":"$E$13*I13","v":0},{"$f":"IF(K12=$C$12,IF(K$11>$C$13,$C$13-$C$12,K$11-$C$12),0)","v":0},{"$f":"$E$13*K13","v":0},{"$f":"IF(M12=$C$12,IF(M$11>$C$13,$C$13-$C$12,M$11-$C$12),0)","v":0},{"$f":"$E$13*M13","v":0},{"$f":"IF(O12=$C$12,IF(O$11>$C$13,$C$13-$C$12,O$11-$C$12),0)","v":0},{"$f":"$E$13*O13","v":0},{"$f":"IF(Q12=$C$12,IF(Q$11>$C$13,$C$13-$C$12,Q$11-$C$12),0)","v":0},{"$f":"$E$13*Q13","v":0}]
[null,{"v":45001,"d":"$45,001"},{"v":120000,"d":"$120,000"},null,{"v":0.325,"d":"32.5%"},null,{"$f":"IF(G13+G12=$C$13,IF(G$11>$C$14,$C$14-$C$13,G$11-$C$13),0)","v":0},{"$f":"$E$14*G14","v":0},{"$f":"IF(I13+I12=$C$13,IF(I$11>$C$14,$C$14-$C$13,I$11-$C$13),0)","v":0},{"$f":"$E$14*I14","v":0},{"$f":"IF(K13+K12=$C$13,IF(K$11>$C$14,$C$14-$C$13,K$11-$C$13),0)","v":0},{"$f":"$E$14*K14","v":0},{"$f":"IF(M13+M12=$C$13,IF(M$11>$C$14,$C$14-$C$13,M$11-$C$13),0)","v":0},{"$f":"$E$14*M14","v":0},{"$f":"IF(O13+O12=$C$13,IF(O$11>$C$14,$C$14-$C$13,O$11-$C$13),0)","v":0},{"$f":"$E$14*O14","v":0},{"$f":"IF(Q13+Q12=$C$13,IF(Q$11>$C$14,$C$14-$C$13,Q$11-$C$13),0)","v":0},{"$f":"$E$14*Q14","v":0}]
[null,{"v":120001,"d":"$120,001"},{"v":180000,"d":"$180,000"},null,{"v":0.37,"d":"37.0%"},null,{"$f":"IF(G14+G13+G12=$C$14,IF(G$11>$C$15,$C$15-$C$14,G$11-$C$14),0)","v":0},{"$f":"$E$15*G15","v":0},{"$f":"IF(I14+I13+I12=$C$14,IF(I$11>$C$15,$C$15-$C$14,I$11-$C$14),0)","v":0},{"$f":"$E$15*I15","v":0},{"$f":"IF(K14+K13+K12=$C$14,IF(K$11>$C$15,$C$15-$C$14,K$11-$C$14),0)","v":0},{"$f":"$E$15*K15","v":0},{"$f":"IF(M14+M13+M12=$C$14,IF(M$11>$C$15,$C$15-$C$14,M$11-$C$14),0)","v":0},{"$f":"$E$15*M15","v":0},{"$f":"IF(O14+O13+O12=$C$14,IF(O$11>$C$15,$C$15-$C$14,O$11-$C$14),0)","v":0},{"$f":"$E$15*O15","v":0},{"$f":"IF(Q14+Q13+Q12=$C$14,IF(Q$11>$C$15,$C$15-$C$14,Q$11-$C$14),0)","v":0},{"$f":"$E$15*Q15","v":0}]
[null,{"v":180001,"d":"$180,001"},{"v":100000000,"d":"$100,000,000"},null,{"v":0.45,"d":"45.0%"},null,{"$f":"IF(G15+G14+G13+G12=$C$15,IF(G$11>$C$16,$C$16-$C$15,G$11-$C$15),0)","v":0},{"$f":"$E$16*G16","v":0},{"$f":"IF(I15+I14+I13+I12=$C$15,IF(I$11>$C$16,$C$16-$C$15,I$11-$C$15),0)","v":0},{"$f":"$E$16*I16","v":0},{"$f":"IF(K15+K14+K13+K12=$C$15,IF(K$11>$C$16,$C$16-$C$15,K$11-$C$15),0)","v":0},{"$f":"$E$16*K16","v":0},{"$f":"IF(M15+M14+M13+M12=$C$15,IF(M$11>$C$16,$C$16-$C$15,M$11-$C$15),0)","v":0},{"$f":"$E$16*M16","v":0},{"$f":"IF(O15+O14+O13+O12=$C$15,IF(O$11>$C$16,$C$16-$C$15,O$11-$C$15),0)","v":0},{"$f":"$E$16*O16","v":0},{"$f":"IF(Q15+Q14+Q13+Q12=$C$15,IF(Q$11>$C$16,$C$16-$C$15,Q$11-$C$15),0)","v":0},{"$f":"$E$16*Q16","v":0}]
[{"$nulls":4},"Taxable IncomeTotals:",null,{"$f":"SUM(G12:G16)","v":0},{"$f":"SUM(H12:H16)","v":0},0,0,0,0,0,0,0,0,0,0]
[]
["Low & Middle Income Tax Offset table",null,null,"Tax Offset","Tax Offset %"]
[null,0,{"v":37000,"d":"$37,000"},0,null,null,{"$f":"IF(G$11>$C$20,$C$20,G$11)","v":0},{"$f":"IF(G$11<$C$20+0.01,$D$20,0)","v":0},{"$f":"IF(I$11>$C$20,$C$20,I$11)","v":0},{"$f":"IF(I$11<$C$20+0.01,$D$20,0)","v":0},{"$f":"IF(K$11>$C$20,$C$20,K$11)","v":0},{"$f":"IF(K$11<$C$20+0.01,$D$20,0)","v":0},{"$f":"IF(M$11>$C$20,$C$20,M$11)","v":0},{"$f":"IF(M$11<$C$20+0.01,$D$20,0)","v":0},{"$f":"IF(O$11>$C$20,$C$20,O$11)","v":0},{"$f":"IF(O$11<$C$20+0.01,$D$20,0)","v":0},{"$f":"IF(Q$11>$C$20,$C$20,Q$11)","v":0},{"$f":"IF(Q$11<$C$20+0.01,$D$20,0)","v":0},"does not exceed $37,000, you will be entitled to an offset amount of $255 on your tax payable."]
[null,{"v":37001,"d":"$37,001"},{"v":48000,"d":"$48,000"},0,{"v":0.075,"d":"7.50%"},null,{"$f":"IF(G20=$C$20,IF(G$11>$C$21,$C$21-$C$20,G$11-$C$20),0)","v":0},{"$f":"IF(G21=0,0,IF(G$11<$C$21+0.01,(((G$11-$C$20)*$E$21)+$D$21),0))","v":0},{"$f":"IF(I20=$C$20,IF(I$11>$C$21,$C$21-$C$20,I$11-$C$20),0)","v":0},{"$f":"IF(I21=0,0,IF(I$11<$C$21+0.01,(((I$11-$C$20)*$E$21)+$D$21),0))","v":0},{"$f":"IF(K20=$C$20,IF(K$11>$C$21,$C$21-$C$20,K$11-$C$20),0)","v":0},{"$f":"IF(K21=0,0,IF(K$11<$C$21+0.01,(((K$11-$C$20)*$E$21)+$D$21),0))","v":0},{"$f":"IF(M20=$C$20,IF(M$11>$C$21,$C$21-$C$20,M$11-$C$20),0)","v":0},{"$f":"IF(M21=0,0,IF(M$11<$C$21+0.01,(((M$11-$C$20)*$E$21)+$D$21),0))","v":0},{"$f":"IF(O20=$C$20,IF(O$11>$C$21,$C$21-$C$20,O$11-$C$20),0)","v":0},{"$f":"IF(O21=0,0,IF(O$11<$C$21+0.01,(((O$11-$C$20)*$E$21)+$D$21),0))","v":0},{"$f":"IF(Q20=$C$20,IF(Q$11>$C$21,$C$21-$C$20,Q$11-$C$20),0)","v":0},{"$f":"IF(Q21=0,0,IF(Q$11<$C$21+0.01,(((Q$11-$C$20)*$E$21)+$D$21),0))","v":0},"exceeds $37,000 but is not more than $48,000, you will be entitled to an offset amount of $255, plus 7.5% of the excess above $37,000 to a maximum offset of $1,080 on your tax payable."]
[null,{"v":48001,"d":"$48,001"},{"v":90000,"d":"$90,000"},0,null,null,{"$f":"IF(G21+G20=$C$21,IF(G$11>$C$22,$C$22-$C$21,G$11-$C$21),0)","v":0},{"$f":"IF(G22=0,0,IF(G$11<$C$22+0.01,(((G$11-$C$21)*$E$22)+$D$22),0))","v":0},{"$f":"IF(I21+I20=$C$21,IF(I$11>$C$22,$C$22-$C$21,I$11-$C$21),0)","v":0},{"$f":"IF(I22=0,0,IF(I$11<$C$22+0.01,(((I$11-$C$21)*$E$22)+$D$22),0))","v":0},{"$f":"IF(K21+K20=$C$21,IF(K$11>$C$22,$C$22-$C$21,K$11-$C$21),0)","v":0},{"$f":"IF(K22=0,0,IF(K$11<$C$22+0.01,(((K$11-$C$21)*$E$22)+$D$22),0))","v":0},{"$f":"IF(M21+M20=$C$21,IF(M$11>$C$22,$C$22-$C$21,M$11-$C$21),0)","v":0},{"$f":"IF(M22=0,0,IF(M$11<$C$22+0.01,(((M$11-$C$21)*$E$22)+$D$22),0))","v":0},{"$f":"IF(O21+O20=$C$21,IF(O$11>$C$22,$C$22-$C$21,O$11-$C$21),0)","v":0},{"$f":"IF(O22=0,0,IF(O$11<$C$22+0.01,(((O$11-$C$21)*$E$22)+$D$22),0))","v":0},{"$f":"IF(Q21+Q20=$C$21,IF(Q$11>$C$22,$C$22-$C$21,Q$11-$C$21),0)","v":0},{"$f":"IF(Q22=0,0,IF(Q$11<$C$22+0.01,(((Q$11-$C$21)*$E$22)+$D$22),0))","v":0},"exceeds $48,000 but is not more than $90,000, you will be entitled to the maximum offset amount of $1,080 on your tax payable."]
[null,{"v":90001,"d":"$90,001"},{"v":126000,"d":"$126,000"},0,{"v":-0.03,"d":"-3%"},null,{"$f":"IF(G22+G21+G20=$C$22,IF(G$11>$C$23,$C$23-$C$22,G$11-$C$22),0)","v":0},{"$f":"IF(G23=0,0,IF(G$11<$C$23+0.01,(((G$11-$C$22)*$E$23)+$D$23),0))","v":0},{"$f":"IF(I22+I21+I20=$C$22,IF(I$11>$C$23,$C$23-$C$22,I$11-$C$22),0)","v":0},{"$f":"IF(I23=0,0,IF(I$11<$C$23+0.01,(((I$11-$C$22)*$E$23)+$D$23),0))","v":0},{"$f":"IF(K22+K21+K20=$C$22,IF(K$11>$C$23,$C$23-$C$22,K$11-$C$22),0)","v":0},{"$f":"IF(K23=0,0,IF(K$11<$C$23+0.01,(((K$11-$C$22)*$E$23)+$D$23),0))","v":0},{"$f":"IF(M22+M21+M20=$C$22,IF(M$11>$C$23,$C$23-$C$22,M$11-$C$22),0)","v":0},{"$f":"IF(M23=0,0,IF(M$11<$C$23+0.01,(((M$11-$C$22)*$E$23)+$D$23),0))","v":0},{"$f":"IF(O22+O21+O20=$C$22,IF(O$11>$C$23,$C$23-$C$22,O$11-$C$22),0)","v":0},{"$f":"IF(O23=0,0,IF(O$11<$C$23+0.01,(((O$11-$C$22)*$E$23)+$D$23),0))","v":0},{"$f":"IF(Q22+Q21+Q20=$C$22,IF(Q$11>$C$23,$C$23-$C$22,Q$11-$C$22),0)","v":0},{"$f":"IF(Q23=0,0,IF(Q$11<$C$23+0.01,(((Q$11-$C$22)*$E$23)+$D$23),0))","v":0},"exceeds $90,000 but is not more than $126,000, you will be entitled to an offset amount $1,080 less 3% of your taxable income above $90,000."]
[null,{"v":126001,"d":"$126,001"},{"v":100000000,"d":"$100,000,000"},{"$nulls":3},{"$f":"IF(G23+G22+G21+G20=$C$23,IF(G$11>$C$24,$C$24-$C$23,G$11-$C$23),0)","v":0},null,{"$f":"IF(I23+I22+I21+I20=$C$23,IF(I$11>$C$24,$C$24-$C$23,I$11-$C$23),0)","v":0},null,{"$f":"IF(K23+K22+K21+K20=$C$23,IF(K$11>$C$24,$C$24-$C$23,K$11-$C$23),0)","v":0},null,{"$f":"IF(M23+M22+M21+M20=$C$23,IF(M$11>$C$24,$C$24-$C$23,M$11-$C$23),0)","v":0},null,{"$f":"IF(O23+O22+O21+O20=$C$23,IF(O$11>$C$24,$C$24-$C$23,O$11-$C$23),0)","v":0},null,{"$f":"IF(Q23+Q22+Q21+Q20=$C$23,IF(Q$11>$C$24,$C$24-$C$23,Q$11-$C$23),0)","v":0}]
[{"$nulls":4},"Low & Middle Income Tax Offse Totals:",null,{"$f":"SUM(G19:G24)","v":0},0,0,0,0,0,0,0,0,0,0,0]
[]
["Low Income Tax Offset",null,null,"Tax Offset","Tax Offset %"]
[null,0,{"v":37500,"d":"$37,500"},700,null,null,{"$f":"IF(G$11>$C$28,$C$28,G$11)","v":0},{"$f":"IF(G$11<$C$28+0.01,$D$28,0)","v":{"v":700,"d":"$700"}},{"$f":"IF(I$11>$C$28,$C$28,I$11)","v":0},{"$f":"IF(I$11<$C$28+0.01,$D$28,0)","v":{"v":700,"d":"$700"}},{"$f":"IF(K$11>$C$28,$C$28,K$11)","v":0},{"$f":"IF(K$11<$C$28+0.01,$D$28,0)","v":{"v":700,"d":"$700"}},{"$f":"IF(M$11>$C$28,$C$28,M$11)","v":0},{"$f":"IF(M$11<$C$28+0.01,$D$28,0)","v":{"v":700,"d":"$700"}},{"$f":"IF(O$11>$C$28,$C$28,O$11)","v":0},{"$f":"IF(O$11<$C$28+0.01,$D$28,0)","v":{"v":700,"d":"$700"}},{"$f":"IF(Q$11>$C$28,$C$28,Q$11)","v":0},{"$f":"IF(Q$11<$C$28+0.01,$D$28,0)","v":{"v":700,"d":"$700"}},"The maximum tax offset of $700 applies if your taxable income is $37,500 or less. \\"]
[null,{"v":37501,"d":"$37,501"},{"v":45000,"d":"$45,000"},700,{"v":-0.05,"d":"-5.00%"},null,{"$f":"IF(G28=$C$28,IF(G$11>$C$29,$C$29-$C$28,G$11-$C$28),0)","v":0},{"$f":"IF(G29=0,0,IF(G$11<$C$29+0.01,(((G$11-$C$28)*$E$29)+$D$29),0))","v":0},{"$f":"IF(I28=$C$28,IF(I$11>$C$29,$C$29-$C$28,I$11-$C$28),0)","v":0},{"$f":"IF(I29=0,0,IF(I$11<$C$29+0.01,(((I$11-$C$28)*$E$29)+$D$29),0))","v":0},{"$f":"IF(K28=$C$28,IF(K$11>$C$29,$C$29-$C$28,K$11-$C$28),0)","v":0},{"$f":"IF(K29=0,0,IF(K$11<$C$29+0.01,(((K$11-$C$28)*$E$29)+$D$29),0))","v":0},{"$f":"IF(M28=$C$28,IF(M$11>$C$29,$C$29-$C$28,M$11-$C$28),0)","v":0},{"$f":"IF(M29=0,0,IF(M$11<$C$29+0.01,(((M$11-$C$28)*$E$29)+$D$29),0))","v":0},{"$f":"IF(O28=$C$28,IF(O$11>$C$29,$C$29-$C$28,O$11-$C$28),0)","v":0},{"$f":"IF(O29=0,0,IF(O$11<$C$29+0.01,(((O$11-$C$28)*$E$29)+$D$29),0))","v":0},{"$f":"IF(Q28=$C$28,IF(Q$11>$C$29,$C$29-$C$28,Q$11-$C$28),0)","v":0},{"$f":"IF(Q29=0,0,IF(Q$11<$C$29+0.01,(((Q$11-$C$28)*$E$29)+$D$29),0))","v":0},"This amount is reduced by 5 cents for each dollar over $37,500 up to $45,000."]
[null,{"v":45001,"d":"$45,001"},{"v":66667,"d":"$66,667"},325,{"v":-0.015,"d":"-1.50%"},null,{"$f":"IF(G29+G28=$C$29,IF(G$11>$C$30,$C$30-$C$29,G$11-$C$29),0)","v":0},{"$f":"IF(G30=0,0,IF(G$11<$C$30+0.01,(((G$11-$C$29)*$E$30)+$D$30),0))","v":0},{"$f":"IF(I29+I28=$C$29,IF(I$11>$C$30,$C$30-$C$29,I$11-$C$29),0)","v":0},{"$f":"IF(I30=0,0,IF(I$11<$C$30+0.01,(((I$11-$C$29)*$E$30)+$D$30),0))","v":0},{"$f":"IF(K29+K28=$C$29,IF(K$11>$C$30,$C$30-$C$29,K$11-$C$29),0)","v":0},{"$f":"IF(K30=0,0,IF(K$11<$C$30+0.01,(((K$11-$C$29)*$E$30)+$D$30),0))","v":0},{"$f":"IF(M29+M28=$C$29,IF(M$11>$C$30,$C$30-$C$29,M$11-$C$29),0)","v":0},{"$f":"IF(M30=0,0,IF(M$11<$C$30+0.01,(((M$11-$C$29)*$E$30)+$D$30),0))","v":0},{"$f":"IF(O29+O28=$C$29,IF(O$11>$C$30,$C$30-$C$29,O$11-$C$29),0)","v":0},{"$f":"IF(O30=0,0,IF(O$11<$C$30+0.01,(((O$11-$C$29)*$E$30)+$D$30),0))","v":0},{"$f":"IF(Q29+Q28=$C$29,IF(Q$11>$C$30,$C$30-$C$29,Q$11-$C$29),0)","v":0},{"$f":"IF(Q30=0,0,IF(Q$11<$C$30+0.01,(((Q$11-$C$29)*$E$30)+$D$30),0))","v":0},"This amount is reduced by 1.55 cents for each dollar over $45,000 up to $66,667"]
[null,{"v":66668,"d":"$66,668"},{"v":100000000,"d":"$100,000,000"},{"$nulls":3},{"$f":"IF(G29+G28+G30=$C$30,IF(G$11>$C$31,$C$31-$C$30,G$11-$C$30),0)","v":0},{"$f":"IF(G31=0,0,IF(G$11<$C$31+0.01,(((G$11-$C$29)*$E$31)+$D$31),0))","v":0},{"$f":"IF(I29+I28+I30=$C$30,IF(I$11>$C$31,$C$31-$C$30,I$11-$C$30),0)","v":0},{"$f":"IF(I31=0,0,IF(I$11<$C$31+0.01,(((I$11-$C$29)*$E$31)+$D$31),0))","v":0},{"$f":"IF(K29+K28+K30=$C$30,IF(K$11>$C$31,$C$31-$C$30,K$11-$C$30),0)","v":0},{"$f":"IF(K31=0,0,IF(K$11<$C$31+0.01,(((K$11-$C$29)*$E$31)+$D$31),0))","v":0},{"$f":"IF(M29+M28+M30=$C$30,IF(M$11>$C$31,$C$31-$C$30,M$11-$C$30),0)","v":0},{"$f":"IF(M31=0,0,IF(M$11<$C$31+0.01,(((M$11-$C$29)*$E$31)+$D$31),0))","v":0},{"$f":"IF(O29+O28+O30=$C$30,IF(O$11>$C$31,$C$31-$C$30,O$11-$C$30),0)","v":0},{"$f":"IF(O31=0,0,IF(O$11<$C$31+0.01,(((O$11-$C$29)*$E$31)+$D$31),0))","v":0},{"$f":"IF(Q29+Q28+Q30=$C$30,IF(Q$11>$C$31,$C$31-$C$30,Q$11-$C$30),0)","v":0},{"$f":"IF(Q31=0,0,IF(Q$11<$C$31+0.01,(((Q$11-$C$29)*$E$31)+$D$31),0))","v":0}]
[{"$nulls":4},"Low Income Tax Offset Totals:",null,null,{"$f":"SUM(H28:H31)","v":{"v":700,"d":"$700"}},null,{"$f":"SUM(J28:J31)","v":{"v":700,"d":"$700"}},null,{"$f":"SUM(L28:L31)","v":{"v":700,"d":"$700"}},null,{"$f":"SUM(N28:N31)","v":{"v":700,"d":"$700"}},null,{"$f":"SUM(P28:P31)","v":{"v":700,"d":"$700"}},null,{"$f":"SUM(R28:R31)","v":{"v":700,"d":"$700"}}]
[]
[{"$nulls":4},"Total Tax",null,null,{"$f":"IF(H17-H25-H32<0,0,H17-H25-H32)","v":0},null,{"$f":"IF(J17-J25-J32<0,0,J17-J25-J32)","v":0},null,{"$f":"IF(L17-L25-L32<0,0,L17-L25-L32)","v":0},null,{"$f":"IF(N17-N25-N32<0,0,N17-N25-N32)","v":0},null,{"$f":"IF(P17-P25-P32<0,0,P17-P25-P32)","v":0},null,{"$f":"IF(R17-R25-R32<0,0,R17-R25-R32)","v":0}]
[]
["Medicare Levy (Yearly)",{"$nulls":17},"In 2018–19, you do not have to pay the Medicare levy if your taxable income is equal to or less than $22,398"]
[null,0,{"v":24276,"d":"$24,276"},0,{"v":0,"d":"0.0%"},null,{"$f":"IF(G$11>$C$37,$C$37,G$11)","v":0},{"$f":"IF(G$11<$C$37+0.01,$D$37,0)","v":0},{"$f":"IF(I$11>$C$37,$C$37,I$11)","v":0},{"$f":"IF(I$11<$C$37+0.01,$D$37,0)","v":0},{"$f":"IF(K$11>$C$37,$C$37,K$11)","v":0},{"$f":"IF(K$11<$C$37+0.01,$D$37,0)","v":0},{"$f":"IF(M$11>$C$37,$C$37,M$11)","v":0},{"$f":"IF(M$11<$C$37+0.01,$D$37,0)","v":0},{"$f":"IF(O$11>$C$37,$C$37,O$11)","v":0},{"$f":"IF(O$11<$C$37+0.01,$D$37,0)","v":0},{"$f":"IF(Q$11>$C$37,$C$37,Q$11)","v":0},{"$f":"IF(Q$11<$C$37+0.01,$D$37,0)","v":0},"You will pay only part of the Medicare levy if your taxable income is between $22,398 and $27,997 "]
[null,{"v":24276,"d":"$24,276"},{"v":30345,"d":"$30,345"},0,{"v":0.1,"d":"10.0%"},null,{"$f":"IF(G37=$C$37,IF(G$11>$C$38,$C$38-$C$37,G$11-$C$37),0)","v":0},{"$f":"IF(G38=0,0,IF(G$11<$C$38+0.01,(((G$11-$C$37)*$E$38)+$D$38),0))","v":0},{"$f":"IF(I37=$C$37,IF(I$11>$C$38,$C$38-$C$37,I$11-$C$37),0)","v":0},{"$f":"IF(I38=0,0,IF(I$11<$C$38+0.01,(((I$11-$C$37)*$E$38)+$D$38),0))","v":0},{"$f":"IF(K37=$C$37,IF(K$11>$C$38,$C$38-$C$37,K$11-$C$37),0)","v":0},{"$f":"IF(K38=0,0,IF(K$11<$C$38+0.01,(((K$11-$C$37)*$E$38)+$D$38),0))","v":0},{"$f":"IF(M37=$C$37,IF(M$11>$C$38,$C$38-$C$37,M$11-$C$37),0)","v":0},{"$f":"IF(M38=0,0,IF(M$11<$C$38+0.01,(((M$11-$C$37)*$E$38)+$D$38),0))","v":0},{"$f":"IF(O37=$C$37,IF(O$11>$C$38,$C$38-$C$37,O$11-$C$37),0)","v":0},{"$f":"IF(O38=0,0,IF(O$11<$C$38+0.01,(((O$11-$C$37)*$E$38)+$D$38),0))","v":0},{"$f":"IF(Q37=$C$37,IF(Q$11>$C$38,$C$38-$C$37,Q$11-$C$37),0)","v":0},{"$f":"IF(Q38=0,0,IF(Q$11<$C$38+0.01,(((Q$11-$C$37)*$E$38)+$D$38),0))","v":0}]
[null,{"v":30345,"d":"$30,345"},{"v":100000000,"d":"$100,000,000"},{"$f":"C38*2%","v":{"v":606.9,"d":"$606.90"}},{"v":0.02,"d":"2.0%"},null,{"$f":"IF(G38+G37=$C$38,IF(G$11>$C$39,$C$39-$C$38,G$11-$C$38),0)","v":0},{"$f":"IF(G39=0,0,IF(G$11<$C$39+0.01,(((G$11-$C$38)*$E$39)+$D$39),0))","v":0},{"$f":"IF(I38+I37=$C$38,IF(I$11>$C$39,$C$39-$C$38,I$11-$C$38),0)","v":0},{"$f":"IF(I39=0,0,IF(I$11<$C$39+0.01,(((I$11-$C$38)*$E$39)+$D$39),0))","v":0},{"$f":"IF(K38+K37=$C$38,IF(K$11>$C$39,$C$39-$C$38,K$11-$C$38),0)","v":0},{"$f":"IF(K39=0,0,IF(K$11<$C$39+0.01,(((K$11-$C$38)*$E$39)+$D$39),0))","v":0},{"$f":"IF(M38+M37=$C$38,IF(M$11>$C$39,$C$39-$C$38,M$11-$C$38),0)","v":0},{"$f":"IF(M39=0,0,IF(M$11<$C$39+0.01,(((M$11-$C$38)*$E$39)+$D$39),0))","v":0},{"$f":"IF(O38+O37=$C$38,IF(O$11>$C$39,$C$39-$C$38,O$11-$C$38),0)","v":0},{"$f":"IF(O39=0,0,IF(O$11<$C$39+0.01,(((O$11-$C$38)*$E$39)+$D$39),0))","v":0},{"$f":"IF(Q38+Q37=$C$38,IF(Q$11>$C$39,$C$39-$C$38,Q$11-$C$38),0)","v":0},{"$f":"IF(Q39=0,0,IF(Q$11<$C$39+0.01,(((Q$11-$C$38)*$E$39)+$D$39),0))","v":0}]
[{"$nulls":4},"Medicare Levy Totals:",null,null,{"$f":"SUM(H37:H39)","v":0},null,{"$f":"SUM(J37:J39)","v":0},null,{"$f":"SUM(L37:L39)","v":0},null,{"$f":"SUM(N37:N39)","v":0},null,{"$f":"SUM(P37:P39)","v":0},null,{"$f":"SUM(R37:R39)","v":0}]
[]
[{"$nulls":4},"Total Tax",null,null,{"$f":"H34+H40","v":0},null,{"$f":"J34+J40","v":0},null,{"$f":"L34+L40","v":0},null,{"$f":"N34+N40","v":0},null,{"$f":"P34+P40","v":0},null,{"$f":"R34+R40","v":0}]
["HECS/HELP Debt",{"$nulls":5},{"$f":"IF(G7>0,G7+G9,G9)","v":0},null,{"$f":"IF(I7>0,I7+I9,I9)","v":0},null,{"$f":"IF(K7>0,K7+K9,K9)","v":0},null,{"$f":"IF(M7>0,M7+M9,M9)","v":0},null,{"$f":"IF(O7>0,O7+O9,O9)","v":0},null,{"$f":"IF(Q7>0,Q7+Q9,Q9)","v":0}]
[null,0,{"v":51550,"d":"$51,550"},null,{"v":0,"d":"0.0%"},null,{"$f":"IF(G$43>$C44,0,IF(G$43<$B44,0,G$43))","v":0},{"$f":"$E44*G44","v":0},{"$f":"IF(I$43>$C44,0,IF(I$43<$B44,0,I$43))","v":0},{"$f":"$E44*I44","v":0},{"$f":"IF(K$43>$C44,0,IF(K$43<$B44,0,K$43))","v":0},{"$f":"$E44*K44","v":0},{"$f":"IF(M$43>$C44,0,IF(M$43<$B44,0,M$43))","v":0},{"$f":"$E44*M44","v":0},{"$f":"IF(O$43>$C44,0,IF(O$43<$B44,0,O$43))","v":0},{"$f":"$E44*O44","v":0},{"$f":"IF(Q$43>$C44,0,IF(Q$43<$B44,0,Q$43))","v":0},{"$f":"$E44*Q44","v":0}]
[null,{"$f":"C44+0.01","v":{"v":51550.01,"d":"$51,550"}},{"v":59518,"d":"$59,518"},null,{"v":0.01,"d":"1.0%"},null,0,{"$f":"$E45*G45","v":0},0,0,0,{"$f":"$E45*K45","v":0},0,{"$f":"$E45*M45","v":0},0,{"$f":"$E45*O45","v":0},0,{"$f":"$E45*Q45","v":0}]
[null,{"v":59518.01,"d":"$59,518"},{"v":63089,"d":"$63,089"},null,{"v":0.02,"d":"2.0%"},null,0,0,0,0,0,0,0,0,0,0,0,0]
[null,{"v":63089.01,"d":"$63,089"},{"v":66875,"d":"$66,875"},null,{"v":0.025,"d":"2.5%"},null,0,0,0,0,0,0,0,0,0,0,0,0]
[null,{"v":66875.01,"d":"$66,875"},{"v":70888,"d":"$70,888"},null,{"v":0.03,"d":"3.0%"},null,0,0,0,0,0,0,0,0,0,0,0,0]
[null,{"v":70888.01,"d":"$70,888"},{"v":75140,"d":"$75,140"},null,{"v":0.035,"d":"3.5%"},null,0,0,0,0,0,0,0,0,0,0,0,0]
[null,{"v":75140.01,"d":"$75,140"},{"v":79649,"d":"$79,649"},null,{"v":0.04,"d":"4.0%"},null,0,0,0,0,0,0,0,0,0,0,0,0]
[null,{"v":79649.01,"d":"$79,649"},{"v":84429,"d":"$84,429"},null,{"v":0.045,"d":"4.5%"},null,0,0,0,0,0,0,0,0,0,0,0,0]
[null,{"v":84429.01,"d":"$84,429"},{"v":89494,"d":"$89,494"},null,{"v":0.05,"d":"5.0%"},null,0,0,0,0,0,0,0,0,0,0,0,0]
[null,{"v":89494.01,"d":"$89,494"},{"v":94865,"d":"$94,865"},null,{"v":0.055,"d":"5.5%"},null,0,0,0,0,0,0,0,0,0,0,0,0]
[null,{"v":94865.01,"d":"$94,865"},{"v":100557,"d":"$100,557"},null,{"v":0.06,"d":"6.0%"},null,0,0,0,0,0,0,0,0,0,0,0,0]
[null,{"v":100557.01,"d":"$100,557"},{"v":106590,"d":"$106,590"},null,{"v":0.065,"d":"6.5%"},null,0,0,0,0,0,0,0,0,0,0,0,0]
[null,{"v":106590.01,"d":"$106,590"},{"v":112985,"d":"$112,985"},null,{"v":0.07,"d":"7.0%"},null,0,0,0,0,0,0,0,0,0,0,0,0]
[null,{"v":112985.01,"d":"$112,985"},{"v":119764,"d":"$119,764"},null,{"v":0.075,"d":"7.5%"},null,0,0,0,0,0,0,0,0,0,0,0,0]
[null,{"v":119764.01,"d":"$119,764"},{"v":126950,"d":"$126,950"},null,{"v":0.08,"d":"8.0%"},null,0,0,0,0,0,0,0,0,0,0,0,0]
[null,{"v":126950.01,"d":"$126,950"},{"v":134568,"d":"$134,568"},null,{"v":0.085,"d":"8.5%"},null,0,0,0,0,0,0,0,0,0,0,0,0]
[null,{"v":134568.01,"d":"$134,568"},{"v":142642,"d":"$142,642"},null,{"v":0.09,"d":"9.0%"},null,0,0,0,0,0,0,0,0,0,0,0,0]
[null,{"v":142642.01,"d":"$142,642"},{"v":151200,"d":"$151,200"},null,{"v":0.095,"d":"9.5%"},null,0,0,0,0,0,0,0,0,0,0,0,0]
[null,{"v":151200.01,"d":"$151,200"},{"v":100000000,"d":"$100,000,000"},null,{"v":0.0999999999999999,"d":"10.0%"},null,0,0,0,0,0,0,0,0,0,0,0,0]
[{"$nulls":4},"HECS/HELP DEBT TOTALS:",null,{"$f":"SUM(G44:G62)","v":0},0,0,0,0,0,0,0,0,0,0,0]
[]
[{"$nulls":4},"Total Tax If HECS/HELP Debt",null,null,{"$f":"H42+H63","v":0},null,{"$f":"J42+J63","v":0},null,{"$f":"L42+L63","v":0},null,{"$f":"N42+N63","v":0},null,{"$f":"P42+P63","v":0},null,{"$f":"R42+R63","v":0}]
{"$rows_empty":10}
[null,null,{"v":52974,"d":"$52,974"},{"v":56151,"d":"$56,151"},{"v":0.02,"d":"2.00%"}]
[null,null,{"v":56152,"d":"$56,152"},{"v":59521,"d":"$59,521"},{"v":0.025,"d":"2.50%"}]
[null,null,{"v":59522,"d":"$59,522"},{"v":63092,"d":"$63,092"},{"v":0.03,"d":"3.00%"}]
[null,null,{"v":63093,"d":"$63,093"},{"v":66877,"d":"$66,877"},{"v":0.035,"d":"3.50%"}]
[null,null,{"v":66878,"d":"$66,878"},{"v":70890,"d":"$70,890"},{"v":0.04,"d":"4.00%"}]
[null,null,{"v":70891,"d":"$70,891"},{"v":75144,"d":"$75,144"},{"v":0.045,"d":"4.50%"}]
[null,null,{"v":75145,"d":"$75,145"},{"v":79652,"d":"$79,652"},{"v":0.05,"d":"5.00%"}]
[null,null,{"v":79653,"d":"$79,653"},{"v":84432,"d":"$84,432"},{"v":0.055,"d":"5.50%"}]
[null,null,{"v":84433,"d":"$84,433"},{"v":89498,"d":"$89,498"},{"v":0.06,"d":"6.00%"}]
[null,null,{"v":89499,"d":"$89,499"},{"v":94868,"d":"$94,868"},{"v":0.065,"d":"6.50%"}]
[null,null,{"v":94869,"d":"$94,869"},{"v":100560,"d":"$100,560"},{"v":0.07,"d":"7.00%"}]
[null,null,{"v":100561,"d":"$100,561"},{"v":106593,"d":"$106,593"},{"v":0.075,"d":"7.50%"}]
[null,null,{"v":106594,"d":"$106,594"},{"v":112989,"d":"$112,989"},{"v":0.08,"d":"8.00%"}]
[null,null,{"v":112990,"d":"$112,990"},{"v":119769,"d":"$119,769"},{"v":0.085,"d":"8.50%"}]
[null,null,{"v":119770,"d":"$119,770"},{"v":126955,"d":"$126,955"},{"v":0.09,"d":"9.00%"}]
[null,null,{"v":126956,"d":"$126,956"},{"v":134572,"d":"$134,572"},{"v":0.095,"d":"9.50%"}]
[null,null,{"v":134573,"d":"$134,573"},null,{"v":0.1,"d":"10%"}]

{"sheet":"HEM","index":14,"n_rows":37,"n_cols":16,"rows_kept":37,"hidden":true}
["Credit Cards",null,{"v":0.038,"d":"3.80%"}]
[]
["Combined Couple Gross Income",null,{"$f":"B4","v":{"v":0,"d":"$0"}},{"v":22000,"d":"$22,000"},{"v":33000,"d":"$33,000"},{"v":44000,"d":"$44,000"},{"v":55000,"d":"$55,000"},{"v":66000,"d":"$66,000"},{"v":87000,"d":"$87,000"},{"v":109000,"d":"$109,000"},{"v":131000,"d":"$131,000"},{"v":153000,"d":"$153,000"},{"v":175000,"d":"$175,000"},{"v":218000,"d":"$218,000"},{"v":273000,"d":"$273,000"},{"v":328000,"d":"$328,000"}]
["HEM 2019Q4",null,{"v":22000,"d":"$22,000"},{"v":33000,"d":"$33,000"},{"v":44000,"d":"$44,000"},{"v":55000,"d":"$55,000"},{"v":66000,"d":"$66,000"},{"v":87000,"d":"$87,000"},{"v":109000,"d":"$109,000"},{"v":131000,"d":"$131,000"},{"v":153000,"d":"$153,000"},{"v":175000,"d":"$175,000"},{"v":218000,"d":"$218,000"},{"v":273000,"d":"$273,000"},{"v":328000,"d":"$328,000"},{"v":9999999,"d":"$9,999,999"}]
[null,null,1,2,3,4,5,6,7,8,9,10,11,12,13,14]
["Elixir - Proposed"]
["Single","IS0",{"$f":"C30","v":{"v":286.552886146764,"d":"$286.55"}},{"$f":"D30","v":{"v":303.5969207411384,"d":"$303.60"}},{"v":317.3700508867374,"d":"$317.37"},{"v":337.08129732731436,"d":"$337.08"},{"v":375.6459481765064,"d":"$375.65"},{"v":431.28751941880444,"d":"$431.29"},{"v":510.8984894773975,"d":"$510.90"},{"v":584.8637194108984,"d":"$584.86"},{"v":672.8408754428881,"d":"$672.84"},{"v":716.7156272341322,"d":"$716.72"},{"v":765.0795213621742,"d":"$765.08"},{"v":891.0897406627076,"d":"$891.09"},{"v":1011.991526888846,"d":"$1,011.99"},{"v":1053.5571453582577,"d":"$1,053.56"}]
["Couple","IC0",{"$f":"C22","v":{"v":562.5749121073926,"d":"$562.57"}},{"$f":"D22","v":{"v":562.5749121073926,"d":"$562.57"}},{"v":576.3277922113473,"d":"$576.33"},{"v":596.0100798303854,"d":"$596.01"},{"v":634.5180869646779,"d":"$634.52"},{"v":690.0779437181496,"d":"$690.08"},{"v":769.5719256656718,"d":"$769.57"},{"v":843.4285528078758,"d":"$843.43"},{"v":931.2764591409833,"d":"$931.28"},{"v":975.0867809407262,"d":"$975.09"},{"v":1023.3796140182511,"d":"$1,023.38"},{"v":1149.2046977166801,"d":"$1,149.20"},{"v":1269.9289259626166,"d":"$1,269.93"},{"v":1311.433487931226,"d":"$1,311.43"}]
["Single parent with 1 child  (per child)","IS1",{"$f":"IF(C31-C30<0,0,C31-C30)","v":{"v":101.24650284179558,"d":"$101.25"}},{"$f":"IF(D31-D30<0,0,D31-D30)","v":{"v":101.24650284179558,"d":"$101.25"}},{"v":101.22402036322904,"d":"$101.22"},{"v":101.19186661340888,"d":"$101.19"},{"v":101.12897208440529,"d":"$101.13"},{"v":101.038238839168,"d":"$101.04"},{"v":100.90834686366662,"d":"$100.91"},{"v":100.78775529182838,"d":"$100.79"},{"v":100.64424567733954,"d":"$100.64"},{"v":100.57266730389563,"d":"$100.57"},{"v":100.49382242096885,"d":"$100.49"},{"v":100.28831756015552,"d":"$100.29"},{"v":100.09112614446008,"d":"$100.09"},{"v":100.02333241364659,"d":"$100.02"}]
["Single parent with 2 children  (per child)","IS2",{"$f":"IF(C32-C30<0,0,C32-C30)/2","v":{"v":107.43171759427085,"d":"$107.43"}},{"$f":"IF(D32-D30<0,0,D32-D30)/2","v":{"v":107.43171759427085,"d":"$107.43"}},{"v":107.40177635266045,"d":"$107.40"},{"v":107.35891545430394,"d":"$107.36"},{"v":107.27505218838843,"d":"$107.28"},{"v":107.15406570416314,"d":"$107.15"},{"v":106.98093345487607,"d":"$106.98"},{"v":106.82010575672041,"d":"$106.82"},{"v":106.62879456132617,"d":"$106.63"},{"v":106.53334971607728,"d":"$106.53"},{"v":106.42821652029517,"d":"$106.43"},{"v":106.15419113141996,"d":"$106.15"},{"v":105.89130188975412,"d":"$105.89"},{"v":105.80089676721468,"d":"$105.80"}]
["Single parent with 3 children  (per child)","IS3",{"$f":"IF(C33-C30<0,0,C33-C30)/3","v":{"v":109.49345584509594,"d":"$109.49"}},{"$f":"IF(D33-D30<0,0,D33-D30)/3","v":{"v":109.49345584509594,"d":"$109.49"}},{"v":109.46102834913758,"d":"$109.46"},{"v":109.41459840126898,"d":"$109.41"},{"v":109.3237455563828,"d":"$109.32"},{"v":109.19267465916153,"d":"$109.19"},{"v":109.00512898527921,"d":"$109.01"},{"v":108.83088924501776,"d":"$108.83"},{"v":108.62364418932172,"d":"$108.62"},{"v":108.52024385347113,"d":"$108.52"},{"v":108.40634788673724,"d":"$108.41"},{"v":108.10948232184141,"d":"$108.11"},{"v":107.82469380485213,"d":"$107.82"},{"v":107.72675155173738,"d":"$107.73"}]
["Single parent with 4 or more children  (per child)","IS4",{"$f":"IF(C33-C30<0,0,C33-C30)/3","v":{"v":109.49345584509594,"d":"$109.49"}},{"$f":"IF(D33-D30<0,0,D33-D30)/3","v":{"v":109.49345584509594,"d":"$109.49"}},{"$f":"IF(E33-E30<0,0,E33-E30)/3","v":{"v":109.46102834913758,"d":"$109.46"}},{"v":109.41459840126898,"d":"$109.41"},{"v":109.3237455563828,"d":"$109.32"},{"v":109.19267465916153,"d":"$109.19"},{"v":109.00512898527921,"d":"$109.01"},{"v":108.83088924501776,"d":"$108.83"},{"v":108.62364418932172,"d":"$108.62"},{"v":108.52024385347113,"d":"$108.52"},{"v":108.40634788673724,"d":"$108.41"},{"v":108.10948232184141,"d":"$108.11"},{"v":107.82469380485213,"d":"$107.82"},{"v":107.72675155173738,"d":"$107.73"}]
["Couple with 1 child (per child)","IC1",{"$f":"IF(C23-C22<0,0,C23-C22)","v":{"v":87.05253270615367,"d":"$87.05"}},{"$f":"IF(D23-D22<0,0,D23-D22)","v":{"v":87.05253270615367,"d":"$87.05"}},{"v":87.05253270615367,"d":"$87.05"},{"v":87.03390033980452,"d":"$87.03"},{"v":86.9975281715324,"d":"$87.00"},{"v":86.94498243523105,"d":"$86.94"},{"v":86.86984053225979,"d":"$86.87"},{"v":86.80002735427388,"d":"$86.80"},{"v":86.71698888152162,"d":"$86.72"},{"v":86.67555863526172,"d":"$86.68"},{"v":86.62992812349228,"d":"$86.63"},{"v":86.5109916203885,"d":"$86.51"},{"v":86.39687671479555,"d":"$86.40"},{"v":86.35764441453966,"d":"$86.36"}]
["Couple with 2 children  (per child)","IC2",{"$f":"IF(C24-C22<0,0,C24-C22)/2","v":{"v":79.75897557917455,"d":"$79.76"}},{"$f":"IF(D24-D22<0,0,D24-D22)/2","v":{"v":79.75897557917455,"d":"$79.76"}},{"v":72.46541845219542,"d":"$72.47"},{"v":79.7608498029748,"d":"$79.76"},{"v":79.76451207454124,"d":"$79.76"},{"v":79.76978425850768,"d":"$79.77"},{"v":79.77738164570297,"d":"$79.78"},{"v":79.78440533973412,"d":"$79.78"},{"v":79.79277977884266,"d":"$79.79"},{"v":79.79690546472534,"d":"$79.80"},{"v":79.80155019863793,"d":"$79.80"},{"v":79.81353175134689,"d":"$79.81"},{"v":79.82502758080659,"d":"$79.83"},{"v":79.8289798062475,"d":"$79.83"}]
["Couple with 3 children  (per child)","IC3",{"$f":"IF(C25-C22<0,0,C25-C22)/3","v":{"v":77.3277898701815,"d":"$77.33"}},{"$f":"IF(D25-D22<0,0,D25-D22)/3","v":{"v":77.3277898701815,"d":"$77.33"}},{"v":72.46541845219542,"d":"$72.47"},{"v":74.01006926235316,"d":"$74.01"},{"v":74.03393362254398,"d":"$74.03"},{"v":74.06835756109915,"d":"$74.07"},{"v":74.11764676644793,"d":"$74.12"},{"v":74.16341728424648,"d":"$74.16"},{"v":74.21786581816268,"d":"$74.22"},{"v":74.24501349856207,"d":"$74.25"},{"v":74.27495793189628,"d":"$74.27"},{"v":74.3529448939449,"d":"$74.35"},{"v":74.4277703224672,"d":"$74.43"},{"v":74.45349503970131,"d":"$74.45"}]
["Couple with 4 or more children  (per child)","IC4",{"$f":"IF(C25-C22<0,0,C25-C22)/3","v":{"v":77.3277898701815,"d":"$77.33"}},{"$f":"IF(D25-D22<0,0,D25-D22)/3","v":{"v":77.3277898701815,"d":"$77.33"}},{"$f":"E15","v":{"v":72.46541845219542,"d":"$72.47"}},{"$f":"IF(F25-F22<0,0,F25-F22)/3","v":{"v":74.01006926235316,"d":"$74.01"}},{"v":74.03393362254398,"d":"$74.03"},{"v":74.06835756109915,"d":"$74.07"},{"v":74.11764676644793,"d":"$74.12"},{"v":74.16341728424648,"d":"$74.16"},{"v":74.21786581816268,"d":"$74.22"},{"v":74.24501349856207,"d":"$74.25"},{"v":74.27495793189628,"d":"$74.27"},{"v":74.3529448939449,"d":"$74.35"},{"v":74.4277703224672,"d":"$74.43"},{"v":74.45349503970131,"d":"$74.45"}]
[]
[]
["Australia",null,{"v":0,"d":"$0"},{"v":25000,"d":"$25,000"},{"v":37000,"d":"$37,000"},{"v":50000,"d":"$50,000"},{"v":62000,"d":"$62,000"},{"v":74000,"d":"$74,000"},{"v":99000,"d":"$99,000"},{"v":124000,"d":"$124,000"},{"v":149000,"d":"$149,000"},{"v":173000,"d":"$173,000"},{"v":198000,"d":"$198,000"},{"v":248000,"d":"$248,000"},{"v":309000,"d":"$309,000"},{"v":371000,"d":"$371,000"}]
[null,{"v":0,"d":"$0"},{"v":25000,"d":"$25,000"},{"v":37000,"d":"$37,000"},{"v":50000,"d":"$50,000"},{"v":62000,"d":"$62,000"},{"v":74000,"d":"$74,000"},{"v":99000,"d":"$99,000"},{"v":124000,"d":"$124,000"},{"v":149000,"d":"$149,000"},{"v":173000,"d":"$173,000"},{"v":198000,"d":"$198,000"},{"v":248000,"d":"$248,000"},{"v":309000,"d":"$309,000"},{"v":371000,"d":"$371,000"},{"v":9999999,"d":"$9,999,999"}]
[null,1,2,3,4,5,6,7,8,9,10,11,12,13,14,15]
["Couple","IC0",{"$f":"D22","v":{"v":562.5749121073926,"d":"$562.57"}},{"v":562.5749121073926,"d":"$562.57"},{"v":576.3277922113473,"d":"$576.33"},{"v":596.0100798303854,"d":"$596.01"},{"v":634.5180869646779,"d":"$634.52"},{"v":690.0779437181496,"d":"$690.08"},{"v":769.5719256656718,"d":"$769.57"},{"v":843.4285528078758,"d":"$843.43"},{"v":931.2764591409833,"d":"$931.28"},{"v":975.0867809407262,"d":"$975.09"},{"v":1023.3796140182511,"d":"$1,023.38"},{"v":1149.2046977166801,"d":"$1,149.20"},{"v":1269.9289259626166,"d":"$1,269.93"},{"v":1311.433487931226,"d":"$1,311.43"}]
["Couple with 1 child","IC1",{"v":649.6274448135463,"d":"$649.63"},{"$f":"D22+(E23-E22)","v":{"v":649.6274448135463,"d":"$649.63"}},{"v":663.380324917501,"d":"$663.38"},{"v":683.0439801701899,"d":"$683.04"},{"v":721.5156151362103,"d":"$721.52"},{"v":777.0229261533807,"d":"$777.02"},{"v":856.4417661979315,"d":"$856.44"},{"v":930.2285801621497,"d":"$930.23"},{"v":1017.9934480225049,"d":"$1,017.99"},{"v":1061.7623395759879,"d":"$1,061.76"},{"v":1110.0095421417434,"d":"$1,110.01"},{"v":1235.7156893370686,"d":"$1,235.72"},{"v":1356.3258026774122,"d":"$1,356.33"},{"v":1397.7911323457656,"d":"$1,397.79"}]
["Couple with 2 children","IC2",{"v":722.0928632657417,"d":"$722.09"},{"$f":"D23+(E24-E23)","v":{"v":722.0928632657417,"d":"$722.09"}},{"v":735.8457433696964,"d":"$735.85"},{"v":755.531779436335,"d":"$755.53"},{"v":794.0471111137604,"d":"$794.05"},{"v":849.617512235165,"d":"$849.62"},{"v":929.1266889570777,"d":"$929.13"},{"v":1002.997363487344,"d":"$1,003.00"},{"v":1090.8620186986686,"d":"$1,090.86"},{"v":1134.6805918701768,"d":"$1,134.68"},{"v":1182.982714415527,"d":"$1,182.98"},{"v":1308.831761219374,"d":"$1,308.83"},{"v":1429.5789811242298,"d":"$1,429.58"},{"v":1471.091447543721,"d":"$1,471.09"}]
["Couple with 3 children","IC3",{"v":794.5582817179371,"d":"$794.56"},{"$f":"D24+(D24-D23)","v":{"v":794.5582817179371,"d":"$794.56"}},{"v":808.3111618218918,"d":"$808.31"},{"v":818.0402876174448,"d":"$818.04"},{"v":856.6198878323098,"d":"$856.62"},{"v":912.2830164014471,"d":"$912.28"},{"v":991.9248659650156,"d":"$991.92"},{"v":1065.9188046606153,"d":"$1,065.92"},{"v":1153.9300565954713,"d":"$1,153.93"},{"v":1197.8218214364124,"d":"$1,197.82"},{"v":1246.20448781394,"d":"$1,246.20"},{"v":1372.2635323985148,"d":"$1,372.26"},{"v":1493.2122369300182,"d":"$1,493.21"},{"v":1534.79397305033,"d":"$1,534.79"}]
["Couple with 4 children","IC4",{"v":867.0237001701325,"d":"$867.02"},{"v":867.0237001701325,"d":"$867.02"},{"v":880.7765802740872,"d":"$880.78"},{"$f":"F25+(F25-F24)","v":{"v":880.5487957985547,"d":"$880.55"}},{"$f":"G25+(G25-G24)","v":{"v":919.1926645508593,"d":"$919.19"}},{"$f":"H25+(H25-H24)","v":{"v":974.9485205677291,"d":"$974.95"}},{"$f":"I25+(I25-I24)","v":{"v":1054.7230429729534,"d":"$1,054.72"}},{"$f":"J25+(J25-J24)","v":{"v":1128.8402458338865,"d":"$1,128.84"}},{"$f":"K25+(K25-K24)","v":{"v":1216.998094492274,"d":"$1,217.00"}},{"$f":"L25+(L25-L24)","v":{"v":1260.963051002648,"d":"$1,260.96"}},{"$f":"M25+(M25-M24)","v":{"v":1309.426261212353,"d":"$1,309.43"}},{"$f":"N25+(N25-N24)","v":{"v":1435.6953035776557,"d":"$1,435.70"}},{"$f":"O25+(O25-O24)","v":{"v":1556.8454927358066,"d":"$1,556.85"}},{"$f":"P25+(P25-P24)","v":{"v":1598.4964985569388,"d":"$1,598.50"}}]
["Couple with 5 children","IC5",{"v":939.489118622328,"d":"$939.49"},{"v":939.489118622328,"d":"$939.49"},{"v":953.2419987262826,"d":"$953.24"},{"$f":"F26+(F26-F25)","v":{"v":943.0573039796645,"d":"$943.06"}},{"v":981.7654412694087,"d":"$981.77"},{"v":1037.6140247340113,"d":"$1,037.61"},{"v":1117.5212199808911,"d":"$1,117.52"},{"v":1191.7616870071577,"d":"$1,191.76"},{"v":1280.0661323890768,"d":"$1,280.07"},{"v":1324.1042805688835,"d":"$1,324.10"},{"v":1372.648034610766,"d":"$1,372.65"},{"v":1499.1270747567967,"d":"$1,499.13"},{"v":1620.478748541595,"d":"$1,620.48"},{"v":1662.1990240635478,"d":"$1,662.20"}]
["Couple with 6 children","IC6",{"v":1011.9545370745234,"d":"$1,011.95"},{"v":1011.9545370745234,"d":"$1,011.95"},{"v":1025.707417178478,"d":"$1,025.71"},{"$f":"F27+(F27-F26)","v":{"v":1005.5658121607744,"d":"$1,005.57"}},{"v":1044.3382179879582,"d":"$1,044.34"},{"v":1100.2795289002934,"d":"$1,100.28"},{"v":1180.3193969888289,"d":"$1,180.32"},{"v":1254.6831281804289,"d":"$1,254.68"},{"v":1343.1341702858795,"d":"$1,343.13"},{"v":1387.245510135119,"d":"$1,387.25"},{"v":1435.869808009179,"d":"$1,435.87"},{"v":1562.5588459359376,"d":"$1,562.56"},{"v":1684.1120043473834,"d":"$1,684.11"},{"v":1725.9015495701567,"d":"$1,725.90"}]
["Couple with 7 children","IC7",{"v":1084.4199555267187,"d":"$1,084.42"},{"v":1084.4199555267187,"d":"$1,084.42"},{"v":1098.1728356306733,"d":"$1,098.17"},{"$f":"F28+(F28-F27)","v":{"v":1068.0743203418842,"d":"$1,068.07"}},{"v":1106.9109947065076,"d":"$1,106.91"},{"v":1162.9450330665754,"d":"$1,162.95"},{"v":1243.1175739967666,"d":"$1,243.12"},{"v":1317.6045693537,"d":"$1,317.60"},{"v":1406.2022081826822,"d":"$1,406.20"},{"v":1450.3867397013546,"d":"$1,450.39"},{"v":1499.091581407592,"d":"$1,499.09"},{"v":1625.9906171150785,"d":"$1,625.99"},{"v":1747.7452601531718,"d":"$1,747.75"},{"v":1789.6040750767656,"d":"$1,789.60"}]
["Single person","IS0",{"v":286.552886146764,"d":"$286.55"},{"v":303.5969207411384,"d":"$303.60"},{"v":317.3700508867374,"d":"$317.37"},{"v":337.08129732731436,"d":"$337.08"},{"v":375.6459481765064,"d":"$375.65"},{"v":431.28751941880444,"d":"$431.29"},{"v":510.8984894773975,"d":"$510.90"},{"v":584.8637194108984,"d":"$584.86"},{"v":672.8408754428881,"d":"$672.84"},{"v":716.7156272341322,"d":"$716.72"},{"v":765.0795213621742,"d":"$765.08"},{"v":891.0897406627076,"d":"$891.09"},{"v":1011.991526888846,"d":"$1,011.99"},{"v":1053.5571453582577,"d":"$1,053.56"}]
["Single parent with 1 child","IS1",{"$f":"C30+(D31-D30)","v":{"v":387.7993889885596,"d":"$387.80"}},{"v":404.84342358293395,"d":"$404.84"},{"v":418.5940712499664,"d":"$418.59"},{"v":438.27316394072324,"d":"$438.27"},{"v":476.7749202609117,"d":"$476.77"},{"v":532.3257582579724,"d":"$532.33"},{"v":611.8068363410641,"d":"$611.81"},{"v":685.6514747027268,"d":"$685.65"},{"v":773.4851211202276,"d":"$773.49"},{"v":817.2882945380278,"d":"$817.29"},{"v":865.5733437831431,"d":"$865.57"},{"v":991.3780582228632,"d":"$991.38"},{"v":1112.082653033306,"d":"$1,112.08"},{"v":1153.5804777719043,"d":"$1,153.58"}]
["Single parent with 2 children","IS2",{"$f":"C31+(D32-D31)","v":{"v":501.4163213353057,"d":"$501.42"}},{"v":518.4603559296801,"d":"$518.46"},{"v":532.1736035920583,"d":"$532.17"},{"v":551.7991282359222,"d":"$551.80"},{"v":590.1960525532833,"d":"$590.20"},{"v":645.5956508271307,"d":"$645.60"},{"v":724.8603563871496,"d":"$724.86"},{"v":798.5039309243392,"d":"$798.50"},{"v":886.0984645655404,"d":"$886.10"},{"v":929.7823266662867,"d":"$929.78"},{"v":977.9359544027645,"d":"$977.94"},{"v":1103.3981229255476,"d":"$1,103.40"},{"v":1223.7741306683542,"d":"$1,223.77"},{"v":1265.158938892687,"d":"$1,265.16"}]
["Single parent with 3 children","IS3",{"$f":"C32+(C32-C31)","v":{"v":615.0332536820518,"d":"$615.03"}},{"v":632.0772882764262,"d":"$632.08"},{"v":645.7531359341501,"d":"$645.75"},{"v":665.3250925311213,"d":"$665.33"},{"v":703.6171848456548,"d":"$703.62"},{"v":758.865543396289,"d":"$758.87"},{"v":837.9138764332351,"d":"$837.91"},{"v":911.3563871459517,"d":"$911.36"},{"v":998.7118080108532,"d":"$998.71"},{"v":1042.2763587945456,"d":"$1,042.28"},{"v":1090.298565022386,"d":"$1,090.30"},{"v":1215.4181876282319,"d":"$1,215.42"},{"v":1335.4656083034024,"d":"$1,335.47"},{"v":1376.7374000134698,"d":"$1,376.74"}]
["Single parent with 4 children","IS4",{"v":728.650186028798,"d":"$728.65"},{"v":745.6942206231723,"d":"$745.69"},{"$f":"E33+(E33-E32)","v":{"v":759.332668276242,"d":"$759.33"}},{"$f":"F33+(F33-F32)","v":{"v":778.8510568263204,"d":"$778.85"}},{"$f":"G33+(G33-G32)","v":{"v":817.0383171380264,"d":"$817.04"}},{"$f":"H33+(H33-H32)","v":{"v":872.1354359654473,"d":"$872.14"}},{"$f":"I33+(I33-I32)","v":{"v":950.9673964793207,"d":"$950.97"}},{"$f":"J33+(J33-J32)","v":{"v":1024.208843367564,"d":"$1,024.21"}},{"$f":"K33+(K33-K32)","v":{"v":1111.3251514561662,"d":"$1,111.33"}},{"$f":"L33+(L33-L32)","v":{"v":1154.7703909228044,"d":"$1,154.77"}},{"$f":"M33+(M33-M32)","v":{"v":1202.6611756420073,"d":"$1,202.66"}},{"$f":"N33+(N33-N32)","v":{"v":1327.4382523309162,"d":"$1,327.44"}},{"$f":"O33+(O33-O32)","v":{"v":1447.1570859384506,"d":"$1,447.16"}},{"$f":"P33+(P33-P32)","v":{"v":1488.3158611342526,"d":"$1,488.32"}}]
["Single parent with 5 children","IS5",{"v":842.2671183755441,"d":"$842.27"},{"v":859.3111529699185,"d":"$859.31"},{"$f":"E34+(E34-E33)","v":{"v":872.9122006183338,"d":"$872.91"}},{"v":892.3770211215194,"d":"$892.38"},{"v":930.459449430398,"d":"$930.46"},{"v":985.4053285346056,"d":"$985.41"},{"v":1064.0209165254062,"d":"$1,064.02"},{"v":1137.0612995891763,"d":"$1,137.06"},{"v":1223.938494901479,"d":"$1,223.94"},{"v":1267.2644230510632,"d":"$1,267.26"},{"v":1315.0237862616286,"d":"$1,315.02"},{"v":1439.4583170336005,"d":"$1,439.46"},{"v":1558.8485635734987,"d":"$1,558.85"},{"v":1599.8943222550354,"d":"$1,599.89"}]
["Single parent with 6 children","IS6",{"v":955.8840507222902,"d":"$955.88"},{"v":972.9280853166646,"d":"$972.93"},{"$f":"E35+(E35-E34)","v":{"v":986.4917329604257,"d":"$986.49"}},{"v":1005.9029854167185,"d":"$1,005.90"},{"v":1043.8805817227694,"d":"$1,043.88"},{"v":1098.6752211037638,"d":"$1,098.68"},{"v":1177.0744365714918,"d":"$1,177.07"},{"v":1249.9137558107886,"d":"$1,249.91"},{"v":1336.551838346792,"d":"$1,336.55"},{"v":1379.758455179322,"d":"$1,379.76"},{"v":1427.38639688125,"d":"$1,427.39"},{"v":1551.4783817362847,"d":"$1,551.48"},{"v":1670.5400412085469,"d":"$1,670.54"},{"v":1711.4727833758182,"d":"$1,711.47"}]
["Single parent with 7 children","IS7",{"v":1069.5009830690365,"d":"$1,069.50"},{"v":1086.5450176634108,"d":"$1,086.55"},{"$f":"E36+(E36-E35)","v":{"v":1100.0712653025175,"d":"$1,100.07"}},{"v":1119.4289497119175,"d":"$1,119.43"},{"v":1157.301714015141,"d":"$1,157.30"},{"v":1211.945113672922,"d":"$1,211.95"},{"v":1290.1279566175774,"d":"$1,290.13"},{"v":1362.766212032401,"d":"$1,362.77"},{"v":1449.165181792105,"d":"$1,449.17"},{"v":1492.2524873075809,"d":"$1,492.25"},{"v":1539.7490075008714,"d":"$1,539.75"},{"v":1663.498446438969,"d":"$1,663.50"},{"v":1782.231518843595,"d":"$1,782.23"},{"v":1823.051244496601,"d":"$1,823.05"}]

{"sheet":"List","index":15,"n_rows":22,"n_cols":16,"rows_kept":22,"hidden":true,"merged":[[21,0,21,8],[21,14,21,16]]}
["Dependents","Applicant Status","HouseholdStatusID","Household","No/Yes",null,"Interest Type"]
[0,"n/a",0,null,"No",null,"Amortising"]
[1,"Individual (Single)","IS",1,"Yes",null,"Bullet"]
[2,"Individual (Couple)","IC",2]
[3,"Company","C",3]
[4]
[5]
[6]
[7]
[]
[null,"Residential",{"$nulls":7},"Commercial",{"$nulls":4},"SMSF","LeaseDoc"]
[null,1,2,3,4,5,6,null,null,1,2,3,4,5]
["Sensitivity  ",{"v":0.02,"d":"2.00%"},{"v":0.02,"d":"2.00%"},{"v":0.02,"d":"2.00%"},{"v":0.02,"d":"2.00%"},{"v":0.02,"d":"2.00%"},{"v":0.02,"d":"2.00%"},null,null,{"v":0.02,"d":"2.00%"},{"v":0.02,"d":"2.00%"},{"v":0.02,"d":"2.00%"},{"v":0.02,"d":"2.00%"},{"v":0.02,"d":"2.00%"},{"v":0.02,"d":"2.00%"},{"v":0.02,"d":"2.00%"}]
["Borrower Rate",{"$f":"Residential!C96","v":{"v":0.05,"d":"5.00%"}},{"$f":"Residential!E96","v":{"v":0.05,"d":"5.00%"}},{"$f":"Residential!G96","v":{"v":0.05,"d":"5.00%"}},{"$f":"Residential!I96","v":{"v":0.05,"d":"5.00%"}},{"$f":"Residential!K96","v":{"v":0.05,"d":"5.00%"}},{"$f":"Residential!M96","v":{"v":0.05,"d":"5.00%"}},null,null,{"$f":"Commercial!C95","v":{"v":0.05,"d":"5.00%"}},{"$f":"Commercial!E95","v":{"v":0.05,"d":"5.00%"}},{"$f":"Commercial!G95","v":{"v":0.05,"d":"5.00%"}},{"$f":"Commercial!I95","v":{"v":0.05,"d":"5.00%"}},{"$f":"Commercial!K95","v":{"v":0.05,"d":"5.00%"}},{"$f":"SMSF!G47","v":{"v":0.05,"d":"5.00%"}},{"$f":"LeaseDoc!G12","v":{"v":0.05,"d":"5.00%"}}]
[null,{"$f":"B13+B14","v":{"v":0.07,"d":"7.00%"}},{"v":0.07,"d":"7.00%"},{"v":0.07,"d":"7.00%"},{"v":0.07,"d":"7.00%"},{"v":0.07,"d":"7.00%"},{"v":0.07,"d":"7.00%"},null,null,{"$f":"J13+J14","v":{"v":0.07,"d":"7.00%"}},{"v":0.07,"d":"7.00%"},{"v":0.07,"d":"7.00%"},{"v":0.07,"d":"7.00%"},{"v":0.07,"d":"7.00%"},{"v":0.07,"d":"7.00%"},{"v":0.07,"d":"7.00%"}]
["Sensitivity Floor",{"v":0.0575,"d":"5.75%"},{"v":0.0575,"d":"5.75%"},{"v":0.0575,"d":"5.75%"},{"v":0.0575,"d":"5.75%"},{"v":0.0575,"d":"5.75%"},{"v":0.0575,"d":"5.75%"},null,null,{"v":0.0575,"d":"5.75%"},{"v":0.0575,"d":"5.75%"},{"v":0.0575,"d":"5.75%"},{"v":0.0575,"d":"5.75%"},{"v":0.0575,"d":"5.75%"},{"v":0.0575,"d":"5.75%"},{"v":0.0575,"d":"5.75%"}]
[]
[]
[]
[]
[]
[" Residential Serviceability Calculator",{"$nulls":13},{"$f":"Menu!A6","v":"Version 1.18 (1 September 2023)"}]

{"sheet":"Linked Picture","index":16,"n_rows":15,"n_cols":11,"rows_kept":15,"hidden":true}
[]
[]
["Country","Flag",{"$nulls":7},{"$f":"VLOOKUP(D4,I4:J16,2,FALSE)","v":"The information contained in this calculator is provided by LoanOne Pty Ltd ACN  161 283 147, Australian Credit License 501182 for illustrative purposes only and should not be regarded as a prediction, or as personal advice. Calculations are not forecasts or projections but is a tool that may assist you to make your own projections. The calculator is not intended to be a substitute for professional advice. The information in this calculator does not constitute an offer to lend, or imply the product is suitable for clients. Before acting on this general information, your client must consider its appropriateness having regard to their own objectives, financial situation and need and also seek independent financial, legal and taxation advice. No guarantee, warranty, or representation is given or implied as to the reliability or accuracy of the information use to compile each index or each calculation. LoanOne specifically disclaims any liability for any direct, indirect, incidental, consequential, or special damages or for any loss arising out of or in any way connected with the access to, reliance on, or use of this calculator."}]
["ORDE Financial",null,null,"Your Manager",{"$nulls":4},"ORDE Financial","The information contained in this calculator is provided by ORDE Financial Pty Limited ACN 634 779 990 Australian Credit Licence 522079 and ORDE Capital Management Limited ACN 636 165 378 Australian Financial Services Licence 523150 Australian Credit Licence 523150 for illustrative purposes only and should not be regarded as a prediction, or as personal advice. Calculations are not forecasts or projections but is a tool that may assist you to make your own projections. The calculator is not intended to be a substitute for professional advice. The information in this calculator does not constitute an offer to lend, or imply the product is suitable for clients. Before acting on this general information, your client must consider its appropriateness having regard to their own objectives, financial situation and need and also seek independent financial, legal and taxation advice. No guarantee, warranty, or representation is given or implied as to the reliability or accuracy of the information use to compile each index or each calculation. ORDE Financial specifically disclaims any liability for any direct, indirect, incidental, consequential, or special damages or for any loss arising out of or in any way connected with the access to, reliance on, or use of this calculator.","ORDE Financial"]
["Resicom",{"$nulls":7},"Resicom","The information contained in this calculator is provided by SJM Financial Solutions Pty Ltd, Australian Credit License 389191 for illustrative purposes only and should not be regarded as a prediction, or as personal advice. Calculations are not forecasts or projections but is a tool that may assist you to make your own projections. The calculator is not intended to be a substitute for professional advice. The information in this calculator does not constitute an offer to lend, or imply the product is suitable for clients. Before acting on this general information, your client must consider its appropriateness having regard to their own objectives, financial situation and need and also seek independent financial, legal and taxation advice. No guarantee, warranty, or representation is given or implied as to the reliability or accuracy of the information use to compile each index or each calculation. SJM specifically disclaims any liability for any direct, indirect, incidental, consequential, or special damages or for any loss arising out of or in any way connected with the access to, reliance on, or use of this calculator."]
["Paramount",{"$nulls":7},"Paramount","The information contained in this calculator is provided by Paramount Mortgages Pty Ltd ACN 104 607 178, Australian Credit License 392788 for illustrative purposes only and should not be regarded as a prediction, or as personal advice. Calculations are not forecasts or projections but is a tool that may assist you to make your own projections. The calculator is not intended to be a substitute for professional advice. The information in this calculator does not constitute an offer to lend, or imply the product is suitable for clients. Before acting on this general information, your client must consider its appropriateness having regard to their own objectives, financial situation and need and also seek independent financial, legal and taxation advice. No guarantee, warranty, or representation is given or implied as to the reliability or accuracy of the information use to compile each index or each calculation. Paramount specifically disclaims any liability for any direct, indirect, incidental, consequential, or special damages or for any loss arising out of or in any way connected with the access to, reliance on, or use of this calculator."]
["Australian Financial",{"$nulls":7},"Australian Financial","The information contained in this calculator is provided by Australian Financial Mortgage Group Pty Ltd ABN 82 138 467 268, Australian Credit License 388993 for illustrative purposes only and should not be regarded as a prediction, or as personal advice. Calculations are not forecasts or projections but is a tool that may assist you to make your own projections. The calculator is not intended to be a substitute for professional advice. The information in this calculator does not constitute an offer to lend, or imply the product is suitable for clients. Before acting on this general information, your client must consider its appropriateness having regard to their own objectives, financial situation and need and also seek independent financial, legal and taxation advice. No guarantee, warranty, or representation is given or implied as to the reliability or accuracy of the information use to compile each index or each calculation. Australian Financial specifically disclaims any liability for any direct, indirect, incidental, consequential, or special damages or for any loss arising out of or in any way connected with the access to, reliance on, or use of this calculator."]
["Tailored Capital",{"$nulls":7},"Tailored Capital","The information contained in this calculator is provided by Tailored Capital Mortgage Management Pty Ltd ACN  647 762 829, Australian Credit License 532563 for illustrative purposes only and should not be regarded as a prediction, or as personal advice. Calculations are not forecasts or projections but is a tool that may assist you to make your own projections. The calculator is not intended to be a substitute for professional advice. The information in this calculator does not constitute an offer to lend, or imply the product is suitable for clients. Before acting on this general information, your client must consider its appropriateness having regard to their own objectives, financial situation and need and also seek independent financial, legal and taxation advice. No guarantee, warranty, or representation is given or implied as to the reliability or accuracy of the information use to compile each index or each calculation. Tailored Capital specifically disclaims any liability for any direct, indirect, incidental, consequential, or special damages or for any loss arising out of or in any way connected with the access to, reliance on, or use of this calculator."]
["emoney",{"$nulls":7},"eMoney","The information contained in this calculator is provided by emoney pty ltd ACN  079 790 364, Australian Credit License 386 494 for illustrative purposes only and should not be regarded as a prediction, or as personal advice. Calculations are not forecasts or projections but is a tool that may assist you to make your own projections. The calculator is not intended to be a substitute for professional advice. The information in this calculator does not constitute an offer to lend, or imply the product is suitable for clients. Before acting on this general information, your client must consider its appropriateness having regard to their own objectives, financial situation and need and also seek independent financial, legal and taxation advice. No guarantee, warranty, or representation is given or implied as to the reliability or accuracy of the information use to compile each index or each calculation. emoney specifically disclaims any liability for any direct, indirect, incidental, consequential, or special damages or for any loss arising out of or in any way connected with the access to, reliance on, or use of this calculator."]
["BMM",{"$nulls":7},"BMM","The information contained in this calculator is provided by Better Mortgage Management Pty Ltd ACN  089 835 192, Australian Credit License 389612 for illustrative purposes only and should not be regarded as a prediction, or as personal advice. Calculations are not forecasts or projections but is a tool that may assist you to make your own projections. The calculator is not intended to be a substitute for professional advice. The information in this calculator does not constitute an offer to lend, or imply the product is suitable for clients. Before acting on this general information, your client must consider its appropriateness having regard to their own objectives, financial situation and need and also seek independent financial, legal and taxation advice. No guarantee, warranty, or representation is given or implied as to the reliability or accuracy of the information use to compile each index or each calculation. Better Mortgage Management specifically disclaims any liability for any direct, indirect, incidental, consequential, or special damages or for any loss arising out of or in any way connected with the access to, reliance on, or use of this calculator."]
["Revas MM",{"$nulls":7},"Revas MM","The information contained in this calculator is provided by Revas Mortgage Management Pty Ltd ACN  644 579 813, Australian Credit License 526391 for illustrative purposes only and should not be regarded as a prediction, or as personal advice. Calculations are not forecasts or projections but is a tool that may assist you to make your own projections. The calculator is not intended to be a substitute for professional advice. The information in this calculator does not constitute an offer to lend, or imply the product is suitable for clients. Before acting on this general information, your client must consider its appropriateness having regard to their own objectives, financial situation and need and also seek independent financial, legal and taxation advice. No guarantee, warranty, or representation is given or implied as to the reliability or accuracy of the information use to compile each index or each calculation. Revas Mortgage Management specifically disclaims any liability for any direct, indirect, incidental, consequential, or special damages or for any loss arising out of or in any way connected with the access to, reliance on, or use of this calculator."]
["Allstate",{"$nulls":7},"Allstate","The information contained in this calculator is provided by Allstate Home Loans Pty Ltd ACN  089 835 192, Australian Credit License 384512 for illustrative purposes only and should not be regarded as a prediction, or as personal advice. Calculations are not forecasts or projections but is a tool that may assist you to make your own projections. The calculator is not intended to be a substitute for professional advice. The information in this calculator does not constitute an offer to lend, or imply the product is suitable for clients. Before acting on this general information, your client must consider its appropriateness having regard to their own objectives, financial situation and need and also seek independent financial, legal and taxation advice. No guarantee, warranty, or representation is given or implied as to the reliability or accuracy of the information use to compile each index or each calculation. Allstate specifically disclaims any liability for any direct, indirect, incidental, consequential, or special damages or for any loss arising out of or in any way connected with the access to, reliance on, or use of this calculator."]
["Infinity Capital",{"$nulls":7},"Infinity Capital","The information contained in this calculator is provided by Infinity Capital Mortgage Management Pty Ltd ACN  632 265 153, Australian Credit License 528727 for illustrative purposes only and should not be regarded as a prediction, or as personal advice. Calculations are not forecasts or projections but is a tool that may assist you to make your own projections. The calculator is not intended to be a substitute for professional advice. The information in this calculator does not constitute an offer to lend, or imply the product is suitable for clients. Before acting on this general information, your client must consider its appropriateness having regard to their own objectives, financial situation and need and also seek independent financial, legal and taxation advice. No guarantee, warranty, or representation is given or implied as to the reliability or accuracy of the information use to compile each index or each calculation. Infinity Capital specifically disclaims any liability for any direct, indirect, incidental, consequential, or special damages or for any loss arising out of or in any way connected with the access to, reliance on, or use of this calculator."]
["Your Manager",{"$nulls":7},"Your Manager","The information contained in this calculator is provided by LoanOne Pty Ltd ACN  161 283 147, Australian Credit License 501182 for illustrative purposes only and should not be regarded as a prediction, or as personal advice. Calculations are not forecasts or projections but is a tool that may assist you to make your own projections. The calculator is not intended to be a substitute for professional advice. The information in this calculator does not constitute an offer to lend, or imply the product is suitable for clients. Before acting on this general information, your client must consider its appropriateness having regard to their own objectives, financial situation and need and also seek independent financial, legal and taxation advice. No guarantee, warranty, or representation is given or implied as to the reliability or accuracy of the information use to compile each index or each calculation. LoanOne specifically disclaims any liability for any direct, indirect, incidental, consequential, or special damages or for any loss arising out of or in any way connected with the access to, reliance on, or use of this calculator."]
["HY Capital",{"$nulls":7},"HY Capital","The information contained in this calculator is provided by HY Capital Pty Ltd ACN  146 212 151, Australian Credit License 382846 for illustrative purposes only and should not be regarded as a prediction, or as personal advice. Calculations are not forecasts or projections but is a tool that may assist you to make your own projections. The calculator is not intended to be a substitute for professional advice. The information in this calculator does not constitute an offer to lend, or imply the product is suitable for clients. Before acting on this general information, your client must consider its appropriateness having regard to their own objectives, financial situation and need and also seek independent financial, legal and taxation advice. No guarantee, warranty, or representation is given or implied as to the reliability or accuracy of the information use to compile each index or each calculation. HY Capital specifically disclaims any liability for any direct, indirect, incidental, consequential, or special damages or for any loss arising out of or in any way connected with the access to, reliance on, or use of this calculator."]